{"text_format":"1","workbook":"xlsx","n_sheets":41,"sheets":["TOC","SETUP","STATUS","A) Cover Page","A) Cover Page 2","B) Table of Content","INSTRUCTIONS","C) PPAP Details","D) PPAP Submission Levels","E) UPLOADS","F) Product Quality Team","1) Product Quality Plan","2) Team Feasibility Commtiment","3) D-FMEA","4) Part History","5) Customer Engineering Appr.","6) Process Flow Chart","7) Factory Floor Plan","8) P-FMEA","9) Control Plan","10) Process Capability Studies","11) Performance Test Report","12) Material Test Report","13) Dimensional Test Report","14) Appearance Approval Report","Calc_MSA","15) Measurement System Analysis","16) Packaging Test Report","17) Product- and Master Sample","18) Part Submission Warrant","19) PSW Deviation Sheet","20) Safety Data Sheet (SDS)","21) Form, Fit and Function","22) Qualified Lab. Doc.","23) List of checking aids","24) Sub Supplier Source Details","25) Type Name (in TOC)","26) Type Name (in TOC)","27) Type Name (in TOC)","28) Type Name (in TOC)","29) Type Name (in TOC)"],"not_rendered":{"charts":0,"images":45,"macros":1,"external_links":0,"defined_names":273,"comments":0,"pivot_tables":0},"unopened":[],"bounds":{"document_bytes":16777216,"sheet_cells":100000,"rows_first":2000,"rows_last":500,"rows_between":2000,"halvings":0,"cell_chars":16384,"cell_head_chars":4096},"cells_cut":0,"cells_raw":0,"read":"whole","date_system":"1900"}

{"sheet":"TOC","index":0,"n_rows":35,"n_cols":2,"rows_kept":35,"cut":false,"hidden":true,"merged":[]}
["Table of Contents","Sheet # – # of Pages"]
[null,"‘1"]
[null,"‘2"]
[null,"‘4"]
[null,"‘5"]
[null,"‘6"]
[null,"‘7"]
[null,"‘8"]
[null,"‘9"]
[null,"‘11"]
[null,"‘11"]
[null,"‘12"]
[null,"‘13"]
[null,"‘14"]
[null,"‘15"]
[null,"‘16"]
[null,"‘17"]
[null,"‘18"]
[null,"‘19"]
[null,"‘20"]
[null,"‘21"]
[null,"‘22"]
[null,"‘23"]
[null,"‘24"]
[null,"‘27"]
[null,"‘26"]
[null,"‘27"]
[null,"‘28"]
[null,"‘30"]
[null,"‘30"]
[null,"‘31"]
[null,"‘32"]
[null,"‘33"]
[null,"‘34"]
[null,"‘35"]

{"sheet":"SETUP","index":1,"n_rows":25,"n_cols":24,"rows_kept":25,"cut":false,"hidden":true,"merged":[]}
[null,null,null,null,"Passeword","Windpower",null,null,null,null,null,null,null,1,1]
[]
[null,null,null,null,null,null,null,null,null,null,null,null,null,null,null,null,2]
[null,null,null,null,null,"SEV",null,"STATUS",null,"RISK",null,"Evaluation",null,"No.","Rank","TSP","Dropdown",null,null,"General information Name","Value",null,null,"Delete"]
[null,null,null,null,null,1,null,"Completed",null,"High Risk",null,"Passed",null,1,{"$f":"IF(P5<>0,1,)","v":0},{"$f":"INDIRECT(\"rng_tech_no_\"&N5)","v":0},{"$f":"IFERROR(VLOOKUP(N5,$O$5:$P$20,2,FALSE),\"\")","v":""},null,null,{"$f":"VLOOKUP(\"D24\",rng_details,rng_details_txt_col,FALSE)","v":"Customer Name"},{"$f":"VLOOKUP(\"D24\",rng_details,rng_details_input_col,FALSE)","v":0},null,null,"Apperance topic"]
[null,null,null,null,null,2,null,"Not Completed",null,"Medium Risk",null,"Failed",null,2,{"$f":"IF(P6<>0,1+O5,O5)","v":0},0,{"$f":"IFERROR(VLOOKUP(N6,$O$5:$P$20,2,FALSE),)","v":0},null,null,{"$f":"VLOOKUP(\"D33\",rng_details,rng_details_txt_col,FALSE)","v":"Supplier Name"},{"$f":"VLOOKUP(\"D33\",rng_details,rng_details_input_col,FALSE)","v":0},null,null,"Surface (Defects can include pinholes, runs, rust, scratch, crack impurities)"]
[null,null,null,null,null,3,null,"In Progress",null,"Low Risk",null,"N/A",null,3,0,0,0,null,null,{"$f":"VLOOKUP(\"D3\",rng_details,rng_details_txt_col,FALSE)","v":"Turbine Type/Name"},{"$f":"VLOOKUP(\"D3\",rng_details,rng_details_input_col,FALSE)","v":0},null,null,"Gloss Details for Painted Parts"]
[null,null,null,null,null,4,null,"N/A",null,null,null,null,null,4,0,0,0,null,null,{"$f":"VLOOKUP(\"D4\",rng_details,rng_details_txt_col,FALSE)","v":"Part Number"},{"$f":"VLOOKUP(\"D4\",rng_details,rng_details_input_col,FALSE)","v":0},null,null,"Graphics (Siemens, Safety, Part no, UL no, Moulders name etc)"]
[null,null,null,null,null,5,null,null,null,null,null,null,null,5,0,0,0,null,null,{"$f":"VLOOKUP(\"D5\",rng_details,rng_details_txt_col,FALSE)","v":"Part Name"},{"$f":"VLOOKUP(\"D5\",rng_details,rng_details_input_col,FALSE)&IF(VLOOKUP(\"D6\",rng_details,6,FALSE)<>\"\",(\" (\"&VLOOKUP(\"D6\",rng_details,6,FALSE)&\")\"),\"\")","v":""},null,null,"Texture (anti-slint)"]
[null,null,null,null,null,6,null,null,null,null,null,null,null,6,0,0,0,null,null,{"$f":"VLOOKUP(\"D9\",rng_details,rng_details_txt_col,FALSE)","v":"Technical Specification (TPS/ZPS no.)"},{"$f":"VLOOKUP(\"D9\",rng_details,rng_details_input_col,FALSE)","v":0},null,null,"RAL Shade Card details for Painted Parts"]
[null,null,null,null,null,7,null,null,null,null,null,null,null,7,0,0,0,null,null,{"$f":"VLOOKUP(\"d11\",rng_details,rng_details_txt_col,FALSE)","v":"Drawing No."},{"$f":"VLOOKUP(\"D11\",rng_details,rng_details_input_col,FALSE)","v":0}]
[null,null,null,null,null,8,null,"Sample_type",null,"TEST_STATUS",null,null,null,8,0,0,0,null,null,{"$f":"VLOOKUP(\"D13\",rng_details,rng_details_txt_col,FALSE)","v":"Engineering Change Level (ECL)"},{"$f":"VLOOKUP(\"D13\",rng_details,rng_details_input_col,FALSE)","v":0}]
[null,null,null,null,null,9,null,"Product sample",null,"Conditional",null,null,null,9,0,0,0,null,null,{"$f":"VLOOKUP(\"D14\",rng_details,rng_details_txt_col,FALSE)","v":"Engineering Change Level Date \n"},{"$f":"IF(VLOOKUP(\"D14\",rng_details,rng_details_input_col,FALSE)=0,\"0\",VLOOKUP(\"D14\",rng_details,rng_details_input_col,FALSE))","v":"0"},null,null,"Delete"]
[null,null,null,null,null,10,null,"Master sample",null,"Approved",null,null,null,10,0,0,0,null,null,{"$f":"VLOOKUP(\"D16\",rng_details,rng_details_txt_col,FALSE)","v":"PPAP Date/Rev."},{"$f":"IF(VLOOKUP(\"D16\",rng_details,rng_details_input_col,FALSE)=0,\"0\",VLOOKUP(\"D16\",rng_details,rng_details_input_col,FALSE))","v":"0"},null,null,"Tech"]
[null,null,null,null,null,null,null,null,null,"Rejected",null,null,null,11,0,0,0,null,null,null,null,null,null,"Tech 1"]
[null,null,null,null,null,null,null,null,null,null,null,null,null,12,0,0,0,null,null,null,null,null,null,"Tech 2"]
[null,null,null,null,null,null,null,null,null,null,null,null,null,13,0,0,0,null,null,"Unlock functions",null,null,null,"Tech 3"]
[null,null,null,null,null,null,null,null,null,null,null,null,null,14,0,0,0,null,null,{"$f":"IF(rng_status_logo<>\"\",rng_status_logo,\"None\")","v":"None"},null,null,null,"Tech 4"]
[null,null,null,null,null,null,null,null,null,null,null,null,null,15,0,0,0,null,null,{"$f":"IF(rng_status_edit=\"Unlocked\",rng_status_edit,\"Locked\")","v":"Locked"}]
[null,null,null,null,null,null,null,null,null,null,null,null,null,16,0,0,0]
[]
[]
[]
[]
["Insert copy Range"]

{"sheet":"STATUS","index":2,"n_rows":8,"n_cols":18,"rows_kept":8,"cut":false,"hidden":true,"merged":[]}
[null,null,null,null,null,null,null,null,null,null,null,null,null,null,null,null,1,1]
[]
[]
[null,"Button text","Unlock Function",null,"Date of function in use",null,"By User",null,"Current Status"]
[]
[null,{"$f":"IF(rng_status_logo=\"Locked\",\" Logo Unlocked\",\"Logo Locked\")","v":"Logo Locked"},null,"Change logo"]
[]
[null,{"$f":"IF(rng_status_edit=\"Locked\",\"Edit Unlocked\",\" Edit Locked\")","v":" Edit Locked"},null,"Change format"]

{"sheet":"A) Cover Page","index":3,"n_rows":54,"n_cols":6,"rows_kept":54,"cut":false,"hidden":false,"merged":[[53,5,53,6],[51,14,51,19],[9,1,9,6],[43,3,43,5],[44,3,44,5],[46,3,46,6],[49,14,49,19],[50,2,50,5],[51,2,51,3]]}
[]
[]
[]
[]
[]
[]
[]
[]
[]
[]
[]
[]
[]
[]
[]
[]
[]
[]
[]
[]
[]
[]
[]
[]
[]
[]
[]
[]
[]
[]
[]
[]
[]
[]
[]
[]
[]
[]
[]
[]
[]
[]
[null,null,"PPAP Project"]
[null,null,"Customer Name:",{"$f":"IFERROR(VLOOKUP(\"D24\",rng_details,rng_details_input_col,FALSE),\"\")","v":0}]
[null,null,"Supplier Name:",{"$f":"VLOOKUP(\"D33\",rng_details,rng_details_input_col,FALSE)","v":0}]
[null,null,"Part Number:",{"$f":"VLOOKUP(\"D4\",rng_details,rng_details_input_col,FALSE)","v":0}]
[null,null,"Part Name:",{"$f":"VLOOKUP(\"D5\",rng_details,rng_details_input_col,FALSE)","v":0}]
[null,null,"Submission Date:",{"$f":"IF(VLOOKUP(\"D1\",rng_details,rng_details_input_col,FALSE)=0,\"0\",VLOOKUP(\"D1\",rng_details,rng_details_input_col,FALSE))","v":"0"}]
[]
[]
[null,null,"Advanced Product Quality Planning Workbook for the Wind Industry"]
[null,null,{"$f":"'A) Cover Page 2'!C24","v":"Version 2.4 - September 2019"}]
[]
[null,null,null,null,null,"For more information, please go to: APQP4Wind.org"]

{"sheet":"A) Cover Page 2","index":4,"n_rows":37,"n_cols":4,"rows_kept":37,"cut":false,"hidden":false,"merged":[[1,2,1,3],[10,2,10,3],[13,2,13,3],[18,2,18,3],[47,2,47,3],[46,2,46,3],[21,2,21,3],[24,2,24,3],[25,2,25,3],[37,2,37,3],[38,2,38,3],[39,2,39,3],[40,2,40,3],[41,2,41,3],[42,2,42,3]]}
[]
[null,null,"APQP4Wind"]
[null,null,"Lysbrohøjen 24"]
[null,null,"8600 Silkeborg"]
[null,null,"Denmark"]
[]
[null,null,"Mail: contact@apqp4wind.org"]
[null,null,"Website: www.apqp4wind.org"]
[null,null,"LinkedIn: APQP4Wind"]
[]
[null,null,"Text and data:"]
[null,null,"Developed by the APQP4Wind Working Group"]
[]
[null,null,"Photo credit, front page:"]
[null,null,"GE Renewable Energy"]
[null,null,"McLean's Mountain Wind Farm, Canada"]
[null,null,"Photographer: John Hryniuk  "]
[]
[null,null,"Copyright:"]
[null,null,"APQP4Wind, all rights reserved"]
[]
[null,null,"Version:"]
[null,null,"Advanced Product Quality Planning Workbook for the Wind Industry"]
[null,null,"Version 2.4 - September 2019"]
[]
[null,null,"Contributors:"]
[null,null,"Bureau Veritas Certification                        ","Ivan Mikkelsen"]
[null,null,"DNV GL                                                               ","Karen Vejby"]
[null,null,"KK Wind Solutions                                          ","Karolina Zielinska"]
[null,null,null,"Claus Lindberg Olesen"]
[null,null,null,"Kim Schmidt Petersen"]
[null,null,"LM Wind Power                                              ","Enrique Escuredo Comonte"]
[null,null,"Siemens Gamesa Renewable Energy      ","Dan Thinggaard"]
[null,null,null,"Erik Jaeger Thomsen"]
[null,null,null,"Helle Højbjerg Nielsen"]
[null,null,null,"Henning Hecker"]
[null,null,"Vestas Wind Systems                                    ","Vinayan EP"]

{"sheet":"B) Table of Content","index":5,"n_rows":39,"n_cols":9,"rows_kept":39,"cut":false,"hidden":false,"merged":[]}
[]
[]
[null,null,null,"½"]
[null,null,"Sl. No","Overview - Sheet names","  ","Page",null,null,"The page numbers will only be updated when a PDF-file is created."]
[null,"ws_PB"]
[null,"ws_PA"]
[null,"ws_PD_3","C","PPAP Submission Details",null,7,null,null,"*Go to the sheet by double clicking on the name"]
[null,"ws_PC","D","PPAP Submission Levels",null,9]
[null,"ws_uploads","E","Uploads",null,12]
[null,"ws_P34","F","Product Quality Team",null,14]
[null,"ws_PB",1,"Product Quality Plan",null,15]
[null,"ws_P1",2,"Team Feasibility Commitment, TFC",null,17]
[null,"ws_p2_3",{"$f":"OFFSET(C13,-1,)+1","v":3},"Design Failure Mode & Effect Analysis, DFMEA",null,19]
[null,"ws_P3",{"$f":"OFFSET(C14,-1,)+1","v":4},"Part History",null,20]
[null,"ws_P4",5,"Customer Engineering Approval",null,21]
[null,"ws_P6",{"$f":"OFFSET(C16,-1,)+1","v":6},"Process Flow Chart",null,22]
[null,"ws_P7",{"$f":"OFFSET(C17,-1,)+1","v":7},"Factory Floor Plan",null,23]
[null,"ws_p8_1",{"$f":"OFFSET(C18,-1,)+1","v":8},"Process Failure Mode & Effect Analysis, PFMEA",null,24]
[null,"ws_P5",9,"Control Plan",null,25]
[null,"ws_P9",10,"Process Capability Studies",null,26]
[null,"ws_P10",11,"Performance Test Report",null,27]
[null,"ws_P11",12,"Material Test Report",null,28]
[null,"ws_P12",13,"Dimension Test Report",null,29]
[null,"ws_P13",14,"Appearance Approval Report",null,30]
[null,"ws_P14_4",15,"Measurement System Analysis",null,31]
[null,"ws_P15",16,"Packaging Test Report",null,32]
[null,"ws_P16",17,"Product and Master Sample",null,33]
[null,"ws_P17_0",18,"Part Submission Warrant, PSW",null,34]
[null,"ws_P17_1",19,"Part Submission Warrant, Deviation Sheet",null,36]
[null,"ws_P18",20,"Safety Data Sheet",null,37]
[null,"ws_p19_2",21,"Form, Fit and Function",null,38]
[null,"ws_P20",22,"Qualified Laboratory Documentation",null,40]
[null,"ws_P21",23,"List of Checking Aids",null,42]
[null,"ws_P22",{"$f":"OFFSET(C34,-1,)+1","v":24},"Sub Supplier Source Details",null,43]
[null,"ws_P30",25,"Type Name (in TOC)",null,44]
[null,"ws_P31",26,"Type Name (in TOC)",null,45]
[null,"ws_P32",27,"Type Name (in TOC)",null,46]
[null,"ws_P33",28,"Type Name (in TOC)",null,47]
[null,"ws_P35",29,"Type Name (in TOC)",null,48]

{"sheet":"INSTRUCTIONS","index":6,"n_rows":60,"n_cols":5,"rows_kept":60,"cut":false,"hidden":false,"merged":[]}
[]
[]
[]
[]
[null,null,"NAVIGATION"]
[null,null,null,"Placed in the upper right corner of the sheet."]
[null,null,null,null,"Go to the next/previous visible sheet"]
[null,null,null,null,"Go to table of contents"]
[]
[null,null,"GENERAL INFORMATION"]
[null,null,null,"Relevant general information is typed in \"D) PPAP Details\" and is"]
[null,null,null,"shown as headers in the workbook."]
[]
[null,null,"RISK"]
[null,null,null,"Selecting risk (\"PPAP Submission Levels\")"]
[null,null,null,"When changing the risk manual, selection will not be saved!"]
[null,null,null,"Manual hide sheet by selection 'NOT APPLICABLE'"]
[]
[null,null,"PARTICIPANTS"]
[null,null,null,"The function is possible on selected sheets. "]
[null,null,null," Add, delete og edit all participants  '2) Team Feasibility Commitment'"]
[null,null,null,null,"Short-cut to editing - located on selected sheets"]
[]
[null,null,null,null,"Go back to the previous sheet"]
[]
[null,null,"UPLOAD FILE"]
[null,null,null,"It is possible to attach PDF files to the model"]
[null,null,null,null,"Attach PDF-file. Name the import file with a short name"]
[]
[null,null,null,null,"Select the PDF illustration and press \"Delete\""]
[null,null,null,"It is possible to get an overview of all uploads on the \"F) UPLOADS\" sheet. "]
[]
[null,null,"TABLES"]
[null,null,null,"All tables (except name tables) in the sheet. "]
[null,null,null,"Adding row","Add a new line by writing in the last line of the table"]
[null,null,null,null,"Select cell(s) inside the table and press the \"Delete Row\""]
[null,null,null,null,"Select cell inside the table and press the \"Add Row\""]
[]
[null,null,"PDF"]
[null,null,null,"Create a PDF file of the workbook located on \"B) Table of Contents\""]
[null,null,null,null,"Create a PDF file of the project"]
[]
[]
[null,null,"ADD OBJECT FROM CLIPBOARD"]
[null,null,null,"This function is possible on selected sheets. "]
[null,null,null,null,"       Inserting an image from the clipboard"]
[null,null,null,null,"       This function only works when an image is copied"]
[]
[null,null,"Unlock model"]
[null,null,null,"Function located on 'C) PPAP Details'"]
[null,null,null,null,"  Insert logo or remove logo"]
[]
[null,null,null,null,"  Edit height and width of rows and columns"]
[]
[null,null,"ADD OR DELETE SECTIONS"]
[null,null,null,"This function is possible on selected sheets. "]
[null,null,null,null,"Add a section to the active worksheet"]
[]
[null,null,null,null,"Delete marked section on active worksheet"]
[null,null,null,null,"Select a cell in section and press delete."]

{"sheet":"C) PPAP Details","index":7,"n_rows":48,"n_cols":20,"rows_kept":48,"cut":false,"hidden":false,"merged":[[9,4,10,4],[12,4,15,4]]}
[]
[]
[null,{"$f":"COLUMN(G7)-COLUMN(B5)+1","v":6},null,null,null,null,null,null,null,null,null,null,null,null,"UPLOADS"]
[null,{"$f":"COLUMN(E7)-COLUMN(B5)+1","v":4}]
[null,"D1","General info",null,"Submission Date:",null,null,null,"(dd-mm-yyyy)"]
[null,"D2"]
[null,"D3","Product information",null,"Turbine Type/Name"]
[null,"D4",null,null,"Part Number"]
[null,"D5",null,null,"Part Name",null,null,null,null,null,null,null,null,null,"Attached file(s)",null,null,null,null,0]
[null,"D6",null,null,"Products Covered in the PPAP Family"]
[null,"D7"]
[null,"D8",null,null,"PPAP - Purchase Order Number"]
[null,"D9",null,null,"Technical Specification (TPS/ZPS no.)",null,null,null,null,null,null,null,null,null,null,"(Only the first number will be transferred to the header of relevant sheets)"]
[null,"D44"]
[null,"D45"]
[null,"D10"]
[]
[null,"D11",null,null,"Drawing No.",null,null,null,null,null,null,null,null,null,null,"(Only the first number will be transferred to the header of relevant sheets)"]
[null,"D12"]
[null,"D13",null,null,"Engineering Change Level (ECL)"]
[null,"D14",null,null,"Engineering Change Level Date \n",null,null,null,"(dd-mm-yyyy)"]
[null,"D15"]
[null,"D16","PPAP information",null,"PPAP Date/Rev.",null,null,null,"(dd-mm-yyyy)"]
[null,"D17",null,null,"Submission Level",null,"High Risk"]
[null,"D20"]
[null,"D21","Customer information",null,"Customer PPAP Responsible"]
[null,"D22",null,null,"Customer Contact (email ID)"]
[null,"D23",null,null,"Phone/Mobile #  with Country Code"]
[null,"D24",null,null,"Customer Name"]
[null,"D25",null,null,"Street Address"]
[null,"D26",null,null,"City"]
[null,"D27",null,null,"Country"]
[null,"D28",null,null,"Zip Code"]
[null,"D29"]
[null,"D30","Supplier information",null,"Supplier PPAP Responsible "]
[null,"D31",null,null,"Supplier Contact (Email ID)"]
[null,"D32",null,null,"Phone/Mobile #  with Country Code"]
[null,"D33",null,null,"Supplier Name"]
[null,"D34",null,null,"Supplier Code"]
[null,"D35",null,null,"Street Address"]
[null,"D36",null,null,"City"]
[null,"D37",null,null,"Country"]
[null,"D38",null,null,"Zip Code"]
[null,"D39",null,null,"Supplier Production Location Name"]
[null,"D40",null,null,"Street Address"]
[null,"D41",null,null,"City"]
[null,"D42",null,null,"Country"]
[null,"D43",null,null,"Zip Code"]

{"sheet":"D) PPAP Submission Levels","index":8,"n_rows":63,"n_cols":16,"rows_kept":63,"cut":false,"hidden":false,"merged":[[26,10,27,10],[26,12,27,12],[5,4,5,8],[6,4,6,8],[26,2,27,3],[26,4,27,5],[26,6,27,7],[26,8,27,9],[26,11,27,11]]}
[]
[]
[]
[null,null,"GENERAL INFORMATION"]
[]
[]
[]
[]
[]
[]
[]
[null,null,"REASON FOR SUBMISSION (check at least one)*",null,null,null,null,null,null,null,null,null,null,null,null,"*Double click to change"]
[]
[null,null,1,"New part design"]
[null,null,null,"Engineering change to design, specification or material"]
[null,null,null,"Correction of discrepancy on a previous PPAP submission"]
[null,null,null,"Change of material or finish"]
[null,null,null,"Production following refurbishment or rearrangement of existing tooling or equipment"]
[null,null,null,"Production from tooling or equipment moved to a different plant location"]
[null,null,null,"Change of subcontractor (e.g. heat-treating, plating) that can or may affect form, fit, function, performance, and/or durability"]
[null,null,null,"Activation of tooling after 12 months or more of inactive status"]
[null,null,null,"Product or process changes related to components of the production part that impact form, fit, function, performance, and/or durability"]
[null,null,null,"Change in the inspection or test method"]
[null,null,null,"Changes in equipment, e.g. new equipment, additional equipment, replacement, or change in equipment size"]
[]
[]
[null,"Last risk","PPAP documentation matrix  1)*",null,"High Risk",null,"Medium Risk",null,"Low Risk",null,"Select PPAP level \n(select risk)","Select","Comments"]
[null,"High Risk"]
[null,null,null,null,"Documentation","Submit/ Retain","Documen- tation","Submit/ Retain","Documentation","Submit/ Retain","High Risk","Submit/ Retain"]
[null,"ws_Pb",1,{"$f":"VLOOKUP(B30,OFFSET(rng_toc,,-1),3,FALSE)","v":"Product Quality Plan"},"M","S","M","S","O","*","RELEVANT","S",null,null,null,"*Go to the sheet by double clicking on the name"]
[null,"ws_P1",2,{"$f":"VLOOKUP(B31,OFFSET(rng_toc,,-1),3,FALSE)","v":"Team Feasibility Commitment, TFC"},"M","S","M","S","O","*","RELEVANT","S"]
[null,"ws_p2_3",{"$f":"OFFSET(C32,-1,)+1","v":3},"Design Failure Mode & Effect Analysis, DFMEA 3)","M","R","O","*","O","*","RELEVANT","R"]
[null,"ws_P3",4,{"$f":"VLOOKUP(B33,OFFSET(rng_toc,,-1),3,FALSE)","v":"Part History"},"M","S","M","S","O","*","RELEVANT","S"]
[null,"ws_P4",5,"Customer Engineering Approval","M","S","M","S","O","*","RELEVANT","S"]
[null,"ws_P6",{"$f":"OFFSET(C35,-1,)+1","v":6},"Process Flow Chart","M","S","M","S","O","*","RELEVANT","S"]
[null,"ws_P7",{"$f":"OFFSET(C36,-1,)+1","v":7},"Factory Floor Plan","M","R","O","*","O","*","RELEVANT","R"]
[null,"ws_P8_1",{"$f":"OFFSET(C37,-1,)+1","v":8},"Process Failure Mode & Effect Analysis, PFMEA","M","S","M","S","O","*","RELEVANT","S"]
[null,"ws_P5",9,"Control Plan","M","S","M","S","O","*","RELEVANT","S"]
[null,"ws_P9",10,"Process Capability Studies","M","S","O","*","O","*","RELEVANT","S"]
[null,"ws_P10",11,"Performance Test Report","M","S","O","*","O","*","RELEVANT","S"]
[null,"ws_P11",12,"Material Test Report","M","S","M","S","O","*","RELEVANT","S"]
[null,"ws_P12",13,"Dimension Test Report","M","S","M","S","O","*","RELEVANT","S"]
[null,"ws_P13",14,"Appearance Approval Report","M","S","O","*","O","*","RELEVANT","S"]
[null,"ws_P14_4",15,"Measurement System Analysis","M","S","O","*","O","*","RELEVANT","S"]
[null,"ws_P15",{"$f":"RIGHT(C44,2)*1+1","v":16},{"$f":"VLOOKUP(B45,OFFSET(rng_toc,,-1),3,FALSE)","v":"Packaging Test Report"},"M","S","O","*","O","*","RELEVANT","S"]
[null,"ws_P16",{"$f":"OFFSET(C46,-1,)+1","v":17},"Product and Master Sample","O","*","O","*","O","*",null,"*"]
[null,"ws_P17_0",{"$f":"OFFSET(C47,-1,)+1","v":18},"Part Submission Warrant, PSW","M","S","M","S","M","S","RELEVANT","S"]
[null,"ws_P17_1",19,"Part Submission Warrant, Deviation Sheet","M","S","M","S","M","S","RELEVANT","S"]
[null,"ws_P18",20,"Safety Data Sheet","M","S","M","S","O","*","RELEVANT","S"]
[null,"ws_p19_2",21,"Form, Fit and Function","M","S","O","*","O","*","RELEVANT","S"]
[null,"ws_P20",22,"Qualified Laboratory Documentation","O","*","O","*","O","*",null,"*"]
[null,"ws_P21",23,"List of Checking Aids","O","*","O","*","O","*",null,"*"]
[null,"ws_P22",{"$f":"OFFSET(C53,-1,)+1","v":24},{"$f":"VLOOKUP(B53,OFFSET(rng_toc,,-1),3,FALSE)","v":"Sub Supplier Source Details"},"O","*","O","*","O","*",null,"*"]
[null,"ws_P30",25,"Type Name (in TOC)","O","*","O","*","O","*",null,"*"]
[null,"ws_P31",26,"Type Name (in TOC)","O","*","O","*","O","*",null,"*"]
[null,"ws_P32",27,"Type Name (in TOC)","O","*","O","*","O","*",null,"*"]
[null,"ws_P33",28,"Type Name (in TOC)","O","*","O","*","O","*",null,"*"]
[null,"ws_P35",29,"Type Name (in TOC)","O","*","O","*","O","*",null,"*"]
[]
[null,null,"M = Mandatory Requirement",null,null,null,null,null,"* = Submit or Retain, to be agreed with PPAP scope agreement"]
[null,null,"O = Optional Requirement, to be agreed with PPAP scope agreement",null,null,null,null,null,"1) = The final PPAP scope agreement can deviate from default, to be agreed between the customer and supplier"]
[null,null,"S = The supplier shall submit the documentation to the customer",null,null,null,null,null,"3) = Can only be required for design responsible suppliers"]
[null,null,"R = The supplier shall retain the document and make it available to the customer upon request"]

{"sheet":"E) UPLOADS","index":9,"n_rows":43,"n_cols":13,"rows_kept":43,"cut":false,"hidden":false,"merged":[]}
[]
[]
[]
[null,null,"GENERAL INFORMATION"]
[]
[]
[]
[]
[]
[]
[]
[null,null,"UPLOADS - PDF*","Upload 1","Upload 2","Upload 3","Upload 4","Upload 5","Upload 6","Upload 7","Upload 8","Upload 9","Upload 10"]
[null,"ws_pd_3",{"$f":"VLOOKUP(B13,OFFSET(rng_toc,,-1),2,FALSE)& \") \" & VLOOKUP(B13,OFFSET(rng_toc,,-1),3,FALSE)","v":"C) PPAP Submission Details"}]
[null,"ws_P34","F) Product Quality Team"]
[null,"ws_PB","1) Product Quality Plan"]
[null,"ws_P1","2) Team Feasibility Commitment, TFC"]
[null,"ws_P2_3","3) Design Failure Mode & Effect Analysis, DFMEA"]
[null,"ws_P3","4) Part History"]
[null,"ws_P4","5) Customer Engineering Approval"]
[null,"ws_P6",{"$f":"VLOOKUP(B20,OFFSET(rng_toc,,-1),2,FALSE)& \") \" & VLOOKUP(B20,OFFSET(rng_toc,,-1),3,FALSE)","v":"6) Process Flow Chart"}]
[null,"ws_P5","9) Control Plan"]
[null,"ws_P7","7) Factory Floor Plan"]
[null,"ws_P8_1","8) Process Failure Mode & Effect Analysis, PFMEA"]
[null,"ws_P9","10) Process Capability Studies"]
[null,"ws_P10","11) Performance Test Report"]
[null,"ws_P11","12) Material Test Report"]
[null,"ws_P12","13) Dimension Test Report"]
[null,"ws_P13","14) Appearance Approval Report"]
[null,"ws_P14_4","15) Measurement System Analysis"]
[null,"ws_P15","16) Packaging Test Report"]
[null,"ws_P16","17) Product and Master Sample"]
[null,"ws_P17_0","18) Part Submission Warrant, PSW"]
[null,"ws_P17_1","19) Part Submission Warrant, Deviation Sheet"]
[null,"ws_P18","20) Safety Data Sheet"]
[null,"ws_p19_2","21) Form, Fit and Function"]
[null,"ws_P20","22) Qualified Laboratory Documentation"]
[null,"ws_P21",{"$f":"VLOOKUP(B37,OFFSET(rng_toc,,-1),2,FALSE)& \") \" & VLOOKUP(B37,OFFSET(rng_toc,,-1),3,FALSE)","v":"23) List of Checking Aids"}]
[null,"ws_P22","24) Sub Supplier Source Details"]
[null,"ws_P30","25) Type Name (in TOC)"]
[null,"ws_P31","26) Type Name (in TOC)"]
[null,"ws_P32","27) Type Name (in TOC)"]
[null,"ws_P33","28) Type Name (in TOC)"]
[null,"ws_P35","29) Type Name (in TOC)"]

{"sheet":"F) Product Quality Team","index":10,"n_rows":17,"n_cols":10,"rows_kept":17,"cut":false,"hidden":false,"merged":[]}
[]
[]
[]
[null,null,null,"GENERAL INFORMATION",null,null,null,null,"UPLOADS"]
[]
[]
[]
[]
[]
[]
[]
[null,null,null,null,null,null,null,null,"Attached file(s)",0]
[null,null,null,{"$f":"UPPER(\"Sheet specific information\")","v":"SHEET SPECIFIC INFORMATION"}]
[]
[]
[null,null,null,"Id","Names","Initials","Function","Company"]
[null,null,null,{"$f":"tbl_names[Initials]&\"_\"&LEFT(tbl_names[Function],3)&\"_\"&LEFT(tbl_names[Company],2)","v":"__"}]

{"sheet":"1) Product Quality Plan","index":11,"n_rows":83,"n_cols":14,"rows_kept":83,"cut":false,"hidden":false,"merged":[]}
[]
[]
[]
[null,null,null,"GENERAL INFORMATION",null,null,null,null,null,"UPLOADS"]
[]
[]
[]
[]
[]
[]
[]
[null,null,null,null,null,null,null,null,null,"Attached file(s)",null,0]
[]
[null,null,null,"S. no.","Deliverables","Column1","Responsible","Target Date","Issues","Actions","Status","Comments"]
[null,null,null,{"$f":"IFERROR(OFFSET(D15,-1,)+1,1)","v":1},"Design Goals"]
[null,null,null,{"$f":"IFERROR(OFFSET(D16,-1,)+1,1)","v":2},"Sub Supplier Screening"]
[null,null,null,{"$f":"IFERROR(OFFSET(D17,-1,)+1,1)","v":3},"APQP Kick off"]
[null,null,null,{"$f":"IFERROR(OFFSET(D18,-1,)+1,1)","v":4},"Production Quality Planning Team"]
[null,null,null,{"$f":"IFERROR(OFFSET(D19,-1,)+1,1)","v":5},"Product Quality Plan "]
[null,null,null,6,"Engineering Design Review"]
[null,null,null,7,"Drawing & Specification Review"]
[null,null,null,8,"Team Feasibility Commitment"]
[null,null,null,9,"DFMEA (Design Failure Mode and Effect Analysis)"]
[null,null,null,10,"Special \nCharacteristics"]
[null,null,null,11,"Design for Manufacturability, Assembly, Transport & Service"]
[null,null,null,12,"Design Verification Plan"]
[null,null,null,13,"New Equipment, Tooling, Gauge/Test- and Facilities Requirement"]
[null,null,null,14,"Preliminary BOM and BOM Management"]
[null,null,null,15,"Sub Supplier - Assessments"]
[null,null,null,16,"Engineering Change Management"]
[null,null,null,17,"Design Verification Report"]
[null,null,null,18,"Tool Design & Approval"]
[null,null,null,19,"Sub Supplier - Product Quality Plan"]
[null,null,null,20,"Customer Engineering Approval"]
[null,null,null,21,"Prototype Control Plan"]
[null,null,null,22,"Prototype Builds"]
[null,null,null,23,"Preliminary Process Flow Chart & Floor Plan"]
[null,null,null,24,"PFMEA (Process Failure Mode and Effect Analysis)"]
[null,null,null,25,"MSA Plan (Measurement Systems Analysis)"]
[null,null,null,26,"Preliminary Process Capability Study Plan"]
[null,null,null,27,"Packaging & Transport Specifications"]
[null,null,null,28,"Process Flow Chart & Floor Plan"]
[null,null,null,29,"Production Tool Builds"]
[null,null,null,30,"0 - Series Control Plan "]
[null,null,null,31,"Work Instructions "]
[null,null,null,32,"Preliminary Process Capability Study"]
[null,null,null,33,"Sub Supplier - PPAP Completion"]
[null,null,null,34,"0-Series Production"]
[null,null,null,35,"Performance - Test report & Certification"]
[null,null,null,36,"Material - Test report & Certification"]
[null,null,null,37,"Dimensional - Report"]
[null,null,null,38,"Appearance Approval - Report"]
[null,null,null,39,"MSA Report (Measurement System Analysis)"]
[null,null,null,40,"Product Validation Testing"]
[null,null,null,{"$f":"IFERROR(OFFSET(D55,-1,)+1,1)","v":41},"Form, Fit & Function"]
[null,null,null,42,"Serial Production Control Plan"]
[null,null,null,43,"Packaging & Transport Evaluation"]
[null,null,null,44,"PPAP Documentation"]
[null,null,null,45,"Master Samples"]
[null,null,null,46,"PPAP Submission & PSW (Part Submission Warrant)"]
[]
[]
[]
[]
[]
[]
[]
[]
[]
[]
[]
[]
[]
[]
[]
[]
[]
[]
[]
[null,null,null,null,null,null,null,null,null,null,null,null,null,"Completed"]
[null,null,null,null,null,null,null,null,null,null,null,null,null,"Not Completed"]
[null,null,null,null,null,null,null,null,null,null,null,null,null,"In Progress"]
[null,null,null,null,null,null,null,null,null,null,null,null,null,"NA"]

{"sheet":"2) Team Feasibility Commtiment","index":12,"n_rows":64,"n_cols":18,"rows_kept":64,"cut":false,"hidden":false,"merged":[[15,1,15,14],[37,1,37,14],[6,10,6,15],[7,10,7,16],[8,10,8,15],[9,10,9,16]]}
[]
[]
[]
[null,"GENERAL INFORMATION",null,null,null,null,null,null,null,null,null,null,null,null,null,"UPLOADS"]
[]
[]
[]
[]
[]
[]
[]
[null,null,null,null,null,null,null,null,null,null,null,null,null,null,null,"Attached file(s)",0]
[]
[null,{"$f":"UPPER(\"Sheet specific information\")","v":"SHEET SPECIFIC INFORMATION"}]
[]
[null,"TEAM FEASIBILITY COMMITMENT"]
[]
[null,null,null,"Responsible Engineer"]
[]
[null,",",null,"ID","Name","Function","Company"]
[null,null,null,null,{"$f":"IFERROR(VLOOKUP(D21,tbl_names[],2,FALSE),\"\")","v":""},{"$f":"IFERROR(VLOOKUP(D21,tbl_names[],4,FALSE),\"\")","v":""},{"$f":"IFERROR(VLOOKUP(D21,tbl_names[],5,FALSE),\"\")","v":""}]
[]
[]
[null,null,null,"Participating"]
[]
[null,null,null,"ID","Name","Function","Company"]
[null,null,null,null,{"$f":"IFERROR(VLOOKUP(D27,tbl_names[],2,FALSE),\"\")","v":""},{"$f":"IFERROR(VLOOKUP(D27,tbl_names[],4,FALSE),\"\")","v":""},{"$f":"IFERROR(VLOOKUP(D27,tbl_names[],5,FALSE),\"\")","v":""}]
[null,null,null,null,{"$f":"IFERROR(VLOOKUP(D28,tbl_names[],2,FALSE),\"\")","v":""},{"$f":"IFERROR(VLOOKUP(D28,tbl_names[],4,FALSE),\"\")","v":""},{"$f":"IFERROR(VLOOKUP(D28,tbl_names[],5,FALSE),\"\")","v":""}]
[null,null,null,null,{"$f":"IFERROR(VLOOKUP(D29,tbl_names[],2,FALSE),\"\")","v":""},{"$f":"IFERROR(VLOOKUP(D29,tbl_names[],4,FALSE),\"\")","v":""},{"$f":"IFERROR(VLOOKUP(D29,tbl_names[],5,FALSE),\"\")","v":""}]
[null,null,null,null,{"$f":"IFERROR(VLOOKUP(D30,tbl_names[],2,FALSE),\"\")","v":""},{"$f":"IFERROR(VLOOKUP(D30,tbl_names[],4,FALSE),\"\")","v":""},{"$f":"IFERROR(VLOOKUP(D30,tbl_names[],5,FALSE),\"\")","v":""}]
[null,null,null,null,{"$f":"IFERROR(VLOOKUP(D31,tbl_names[],2,FALSE),\"\")","v":""},{"$f":"IFERROR(VLOOKUP(D31,tbl_names[],4,FALSE),\"\")","v":""},{"$f":"IFERROR(VLOOKUP(D31,tbl_names[],5,FALSE),\"\")","v":""}]
[null,null,null,null,{"$f":"IFERROR(VLOOKUP(D32,tbl_names[],2,FALSE),\"\")","v":""},{"$f":"IFERROR(VLOOKUP(D32,tbl_names[],4,FALSE),\"\")","v":""},{"$f":"IFERROR(VLOOKUP(D32,tbl_names[],5,FALSE),\"\")","v":""}]
[null,null,null,null,{"$f":"IFERROR(VLOOKUP(D33,tbl_names[],2,FALSE),\"\")","v":""},{"$f":"IFERROR(VLOOKUP(D33,tbl_names[],4,FALSE),\"\")","v":""},{"$f":"IFERROR(VLOOKUP(D33,tbl_names[],5,FALSE),\"\")","v":""}]
[]
[]
[]
[null,"Feasibility Considerations"]
[null,"Our product quality planning team has considered the following questions, not intended to be all-inclusive in performing a feasibility evaluation.  The drawings and/or specifications provided have been used as a basis for analyzing the ability to meet all specified requirements. All \"no\" answers are supported with attached comments identifying our concerns and/or proposed changes to enable us to meet the specified requirements."]
[]
[null,"CONSIDERATION",null,null,null,null,null,null,"YES*",null,null,"NO*",null,"NA*",null,"Comments",null,"Internal Comments"]
[]
[null,"Is product adequately defined (application requirements, etc. to enable feasibility evaluation)?"]
[null,"Can Engineering Performance Specifications be met as written?"]
[null,"Can product be manufactured to tolerances specified on drawing?"]
[null,"Can product be manufactured with Cpk's that meet requirements?"]
[null,"Is there adequate capacity to produce product?"]
[null,"Does the design allow the use of efficient material handling techniques?"]
[null,"Can the product be manufactured without incurring any unusual:"]
[null,null,null,"- Costs for capital equipment?"]
[null,null,null,"- Costs for tooling?"]
[null,null,null,"- Alternative manufacturing methods?"]
[null,"Is statistical process control required on the product?"]
[null,"Is statistical process control presently used on similar products?"]
[null,"Where statistical process control is used on similar products:"]
[null,null,null,"- Are the processes in control and stable?"]
[null,null,null,"- Are cpk's greater than 1.33?"]
[]
[null,null,null,null,null,null,null,"*Double click to change"]
[null,"Conclusion"]
[]
[]
[null,null,null,"Feasible*","Product can be produced as specified with no revisions."]
[null,null,null,"Feasible*","Changes recommended (see attached)."]
[null,null,null,"Not Feasible*","Design revision required to produce product within the specified requirements."]

{"sheet":"3) D-FMEA","index":13,"n_rows":70,"n_cols":23,"rows_kept":70,"cut":false,"hidden":false,"merged":[[42,16,42,22]]}
[]
[]
[]
[null,null,"GENERAL INFORMATION",null,null,null,null,null,null," UPLOADS"]
[]
[]
[]
[]
[]
[]
[]
[null,null,null,null,null,null,null,null,null,"Attached file(s)",0]
[]
[null,"Section",{"$f":"UPPER(\"Sheet specific INFORMATION\")","v":"SHEET SPECIFIC INFORMATION"}]
[]
[null,{"$f":"OFFSET(B16,-1,)+1","v":1}]
[null,{"$f":"OFFSET(B17,-1,)","v":1},"D-FMEA",null,null,"Supplier"]
[null,1]
[null,1,"Ref. Number."]
[null,1]
[null,1,"Revision Number."]
[null,1]
[null,1,"Design Responsible Engineer."]
[null,1]
[null,1,"ID","Name","Function","Company"]
[null,1,null,{"$f":"IFERROR(VLOOKUP(C26,tbl_names[],2,FALSE),\"\")","v":""},{"$f":"IFERROR(VLOOKUP(C26,tbl_names[],4,FALSE),\"\")","v":""},{"$f":"IFERROR(VLOOKUP(C26,tbl_names[],5,FALSE),\"\")","v":""}]
[null,1]
[null,1,"Participating"]
[null,1]
[null,1,"ID","Names","Function","Company"]
[null,1,null,{"$f":"IFERROR(VLOOKUP(C31,tbl_names[],2,FALSE),\"\")","v":""},{"$f":"IFERROR(VLOOKUP(C31,tbl_names[],4,FALSE),\"\")","v":""},{"$f":"IFERROR(VLOOKUP(C31,tbl_names[],5,FALSE),\"\")","v":""}]
[null,1,null,{"$f":"IFERROR(VLOOKUP(C32,tbl_names[],2,FALSE),\"\")","v":""},{"$f":"IFERROR(VLOOKUP(C32,tbl_names[],4,FALSE),\"\")","v":""},{"$f":"IFERROR(VLOOKUP(C32,tbl_names[],5,FALSE),\"\")","v":""}]
[null,1,null,{"$f":"IFERROR(VLOOKUP(C33,tbl_names[],2,FALSE),\"\")","v":""},{"$f":"IFERROR(VLOOKUP(C33,tbl_names[],4,FALSE),\"\")","v":""},{"$f":"IFERROR(VLOOKUP(C33,tbl_names[],5,FALSE),\"\")","v":""}]
[null,1,null,{"$f":"IFERROR(VLOOKUP(C34,tbl_names[],2,FALSE),\"\")","v":""},{"$f":"IFERROR(VLOOKUP(C34,tbl_names[],4,FALSE),\"\")","v":""},{"$f":"IFERROR(VLOOKUP(C34,tbl_names[],5,FALSE),\"\")","v":""}]
[null,1,null,{"$f":"IFERROR(VLOOKUP(C35,tbl_names[],2,FALSE),\"\")","v":""},{"$f":"IFERROR(VLOOKUP(C35,tbl_names[],4,FALSE),\"\")","v":""},{"$f":"IFERROR(VLOOKUP(C35,tbl_names[],5,FALSE),\"\")","v":""}]
[null,1,null,{"$f":"IFERROR(VLOOKUP(C36,tbl_names[],2,FALSE),\"\")","v":""},{"$f":"IFERROR(VLOOKUP(C36,tbl_names[],4,FALSE),\"\")","v":""},{"$f":"IFERROR(VLOOKUP(C36,tbl_names[],5,FALSE),\"\")","v":""}]
[null,1,null,{"$f":"IFERROR(VLOOKUP(C37,tbl_names[],2,FALSE),\"\")","v":""},{"$f":"IFERROR(VLOOKUP(C37,tbl_names[],4,FALSE),\"\")","v":""},{"$f":"IFERROR(VLOOKUP(C37,tbl_names[],5,FALSE),\"\")","v":""}]
[null,1,null,{"$f":"IFERROR(VLOOKUP(C38,tbl_names[],2,FALSE),\"\")","v":""},{"$f":"IFERROR(VLOOKUP(C38,tbl_names[],4,FALSE),\"\")","v":""},{"$f":"IFERROR(VLOOKUP(C38,tbl_names[],5,FALSE),\"\")","v":""}]
[null,1,null,{"$f":"IFERROR(VLOOKUP(C39,tbl_names[],2,FALSE),\"\")","v":""},{"$f":"IFERROR(VLOOKUP(C39,tbl_names[],4,FALSE),\"\")","v":""},{"$f":"IFERROR(VLOOKUP(C39,tbl_names[],5,FALSE),\"\")","v":""}]
[null,1,null,{"$f":"IFERROR(VLOOKUP(C40,tbl_names[],2,FALSE),\"\")","v":""},{"$f":"IFERROR(VLOOKUP(C40,tbl_names[],4,FALSE),\"\")","v":""},{"$f":"IFERROR(VLOOKUP(C40,tbl_names[],5,FALSE),\"\")","v":""}]
[null,1]
[null,1]
[null,1,null,null,null,null,null,null,null,"Current Design Controls",null,null,null,null,null,null,"Action Results"]
[null,1,"Item/Function","Requirements","Potential Failure Mode","Potential Effect(s) of Failure","Sev","Class","Potential Cause(s)/Mechanism(s) of Failure","Controls\nPrevention","Occ","Controls\nDetection","Det","R.N.","R.P.N.","Recommended Actions","Responsibility & Target Date","Actions Taken","Sev ","Occ ","Det "," R.N."," R.P.N."]
[null,1,null,null,null,null,null,null,null,null,null,null,null,{"$f":"Table2183147[[#This Row],[Sev]]*Table2183147[[#This Row],[Occ]]","v":0},{"$f":"(Table2183147[[#This Row],[Sev]]*Table2183147[[#This Row],[Occ]])*Table2183147[[#This Row],[Det]]","v":0},null,null,null,null,null,null,{"$f":"Table2183147[[#This Row],[Sev ]]*Table2183147[[#This Row],[Occ ]]","v":0},{"$f":"(Table2183147[[#This Row],[Sev ]]*Table2183147[[#This Row],[Occ ]])*Table2183147[[#This Row],[Det ]]","v":0}]
[null,1,null,null,null,null,null,null,null,null,null,null,null,{"$f":"Table2183147[[#This Row],[Sev]]*Table2183147[[#This Row],[Occ]]","v":0},{"$f":"(Table2183147[[#This Row],[Sev]]*Table2183147[[#This Row],[Occ]])*Table2183147[[#This Row],[Det]]","v":0},null,null,null,null,null,null,{"$f":"Table2183147[[#This Row],[Sev ]]*Table2183147[[#This Row],[Occ ]]","v":0},{"$f":"(Table2183147[[#This Row],[Sev ]]*Table2183147[[#This Row],[Occ ]])*Table2183147[[#This Row],[Det ]]","v":0}]
[null,1,null,null,null,null,null,null,null,null,null,null,null,{"$f":"Table2183147[[#This Row],[Sev]]*Table2183147[[#This Row],[Occ]]","v":0},{"$f":"(Table2183147[[#This Row],[Sev]]*Table2183147[[#This Row],[Occ]])*Table2183147[[#This Row],[Det]]","v":0},null,null,null,null,null,null,{"$f":"Table2183147[[#This Row],[Sev ]]*Table2183147[[#This Row],[Occ ]]","v":0},{"$f":"(Table2183147[[#This Row],[Sev ]]*Table2183147[[#This Row],[Occ ]])*Table2183147[[#This Row],[Det ]]","v":0}]
[null,1,null,null,null,null,null,null,null,null,null,null,null,{"$f":"Table2183147[[#This Row],[Sev]]*Table2183147[[#This Row],[Occ]]","v":0},{"$f":"(Table2183147[[#This Row],[Sev]]*Table2183147[[#This Row],[Occ]])*Table2183147[[#This Row],[Det]]","v":0},null,null,null,null,null,null,{"$f":"Table2183147[[#This Row],[Sev ]]*Table2183147[[#This Row],[Occ ]]","v":0},{"$f":"(Table2183147[[#This Row],[Sev ]]*Table2183147[[#This Row],[Occ ]])*Table2183147[[#This Row],[Det ]]","v":0}]
[null,1,null,null,null,null,null,null,null,null,null,null,null,{"$f":"Table2183147[[#This Row],[Sev]]*Table2183147[[#This Row],[Occ]]","v":0},{"$f":"(Table2183147[[#This Row],[Sev]]*Table2183147[[#This Row],[Occ]])*Table2183147[[#This Row],[Det]]","v":0},null,null,null,null,null,null,{"$f":"Table2183147[[#This Row],[Sev ]]*Table2183147[[#This Row],[Occ ]]","v":0},{"$f":"(Table2183147[[#This Row],[Sev ]]*Table2183147[[#This Row],[Occ ]])*Table2183147[[#This Row],[Det ]]","v":0}]
[null,1,null,null,null,null,null,null,null,null,null,null,null,{"$f":"Table2183147[[#This Row],[Sev]]*Table2183147[[#This Row],[Occ]]","v":0},{"$f":"(Table2183147[[#This Row],[Sev]]*Table2183147[[#This Row],[Occ]])*Table2183147[[#This Row],[Det]]","v":0},null,null,null,null,null,null,{"$f":"Table2183147[[#This Row],[Sev ]]*Table2183147[[#This Row],[Occ ]]","v":0},{"$f":"(Table2183147[[#This Row],[Sev ]]*Table2183147[[#This Row],[Occ ]])*Table2183147[[#This Row],[Det ]]","v":0}]
[null,1,null,null,null,null,null,null,null,null,null,null,null,{"$f":"Table2183147[[#This Row],[Sev]]*Table2183147[[#This Row],[Occ]]","v":0},{"$f":"(Table2183147[[#This Row],[Sev]]*Table2183147[[#This Row],[Occ]])*Table2183147[[#This Row],[Det]]","v":0},null,null,null,null,null,null,{"$f":"Table2183147[[#This Row],[Sev ]]*Table2183147[[#This Row],[Occ ]]","v":0},{"$f":"(Table2183147[[#This Row],[Sev ]]*Table2183147[[#This Row],[Occ ]])*Table2183147[[#This Row],[Det ]]","v":0}]
[null,1,null,null,null,null,null,null,null,null,null,null,null,{"$f":"Table2183147[[#This Row],[Sev]]*Table2183147[[#This Row],[Occ]]","v":0},{"$f":"(Table2183147[[#This Row],[Sev]]*Table2183147[[#This Row],[Occ]])*Table2183147[[#This Row],[Det]]","v":0},null,null,null,null,null,null,{"$f":"Table2183147[[#This Row],[Sev ]]*Table2183147[[#This Row],[Occ ]]","v":0},{"$f":"(Table2183147[[#This Row],[Sev ]]*Table2183147[[#This Row],[Occ ]])*Table2183147[[#This Row],[Det ]]","v":0}]
[null,1,null,null,null,null,null,null,null,null,null,null,null,{"$f":"Table2183147[[#This Row],[Sev]]*Table2183147[[#This Row],[Occ]]","v":0},{"$f":"(Table2183147[[#This Row],[Sev]]*Table2183147[[#This Row],[Occ]])*Table2183147[[#This Row],[Det]]","v":0},null,null,null,null,null,null,{"$f":"Table2183147[[#This Row],[Sev ]]*Table2183147[[#This Row],[Occ ]]","v":0},{"$f":"(Table2183147[[#This Row],[Sev ]]*Table2183147[[#This Row],[Occ ]])*Table2183147[[#This Row],[Det ]]","v":0}]
[null,1,null,null,null,null,null,null,null,null,null,null,null,{"$f":"Table2183147[[#This Row],[Sev]]*Table2183147[[#This Row],[Occ]]","v":0},{"$f":"(Table2183147[[#This Row],[Sev]]*Table2183147[[#This Row],[Occ]])*Table2183147[[#This Row],[Det]]","v":0},null,null,null,null,null,null,{"$f":"Table2183147[[#This Row],[Sev ]]*Table2183147[[#This Row],[Occ ]]","v":0},{"$f":"(Table2183147[[#This Row],[Sev ]]*Table2183147[[#This Row],[Occ ]])*Table2183147[[#This Row],[Det ]]","v":0}]
[null,1,null,null,null,null,null,null,null,null,null,null,null,{"$f":"Table2183147[[#This Row],[Sev]]*Table2183147[[#This Row],[Occ]]","v":0},{"$f":"(Table2183147[[#This Row],[Sev]]*Table2183147[[#This Row],[Occ]])*Table2183147[[#This Row],[Det]]","v":0},null,null,null,null,null,null,{"$f":"Table2183147[[#This Row],[Sev ]]*Table2183147[[#This Row],[Occ ]]","v":0},{"$f":"(Table2183147[[#This Row],[Sev ]]*Table2183147[[#This Row],[Occ ]])*Table2183147[[#This Row],[Det ]]","v":0}]
[null,1,null,null,null,null,null,null,null,null,null,null,null,{"$f":"Table2183147[[#This Row],[Sev]]*Table2183147[[#This Row],[Occ]]","v":0},{"$f":"(Table2183147[[#This Row],[Sev]]*Table2183147[[#This Row],[Occ]])*Table2183147[[#This Row],[Det]]","v":0},null,null,null,null,null,null,{"$f":"Table2183147[[#This Row],[Sev ]]*Table2183147[[#This Row],[Occ ]]","v":0},{"$f":"(Table2183147[[#This Row],[Sev ]]*Table2183147[[#This Row],[Occ ]])*Table2183147[[#This Row],[Det ]]","v":0}]
[null,1,null,null,null,null,null,null,null,null,null,null,null,{"$f":"Table2183147[[#This Row],[Sev]]*Table2183147[[#This Row],[Occ]]","v":0},{"$f":"(Table2183147[[#This Row],[Sev]]*Table2183147[[#This Row],[Occ]])*Table2183147[[#This Row],[Det]]","v":0},null,null,null,null,null,null,{"$f":"Table2183147[[#This Row],[Sev ]]*Table2183147[[#This Row],[Occ ]]","v":0},{"$f":"(Table2183147[[#This Row],[Sev ]]*Table2183147[[#This Row],[Occ ]])*Table2183147[[#This Row],[Det ]]","v":0}]
[null,1,null,null,null,null,null,null,null,null,null,null,null,{"$f":"Table2183147[[#This Row],[Sev]]*Table2183147[[#This Row],[Occ]]","v":0},{"$f":"(Table2183147[[#This Row],[Sev]]*Table2183147[[#This Row],[Occ]])*Table2183147[[#This Row],[Det]]","v":0},null,null,null,null,null,null,{"$f":"Table2183147[[#This Row],[Sev ]]*Table2183147[[#This Row],[Occ ]]","v":0},{"$f":"(Table2183147[[#This Row],[Sev ]]*Table2183147[[#This Row],[Occ ]])*Table2183147[[#This Row],[Det ]]","v":0}]
[null,1,null,null,null,null,null,null,null,null,null,null,null,{"$f":"Table2183147[[#This Row],[Sev]]*Table2183147[[#This Row],[Occ]]","v":0},{"$f":"(Table2183147[[#This Row],[Sev]]*Table2183147[[#This Row],[Occ]])*Table2183147[[#This Row],[Det]]","v":0},null,null,null,null,null,null,{"$f":"Table2183147[[#This Row],[Sev ]]*Table2183147[[#This Row],[Occ ]]","v":0},{"$f":"(Table2183147[[#This Row],[Sev ]]*Table2183147[[#This Row],[Occ ]])*Table2183147[[#This Row],[Det ]]","v":0}]
[null,1,null,null,null,null,null,null,null,null,null,null,null,{"$f":"Table2183147[[#This Row],[Sev]]*Table2183147[[#This Row],[Occ]]","v":0},{"$f":"(Table2183147[[#This Row],[Sev]]*Table2183147[[#This Row],[Occ]])*Table2183147[[#This Row],[Det]]","v":0},null,null,null,null,null,null,{"$f":"Table2183147[[#This Row],[Sev ]]*Table2183147[[#This Row],[Occ ]]","v":0},{"$f":"(Table2183147[[#This Row],[Sev ]]*Table2183147[[#This Row],[Occ ]])*Table2183147[[#This Row],[Det ]]","v":0}]
[null,1,null,null,null,null,null,null,null,null,null,null,null,{"$f":"Table2183147[[#This Row],[Sev]]*Table2183147[[#This Row],[Occ]]","v":0},{"$f":"(Table2183147[[#This Row],[Sev]]*Table2183147[[#This Row],[Occ]])*Table2183147[[#This Row],[Det]]","v":0},null,null,null,null,null,null,{"$f":"Table2183147[[#This Row],[Sev ]]*Table2183147[[#This Row],[Occ ]]","v":0},{"$f":"(Table2183147[[#This Row],[Sev ]]*Table2183147[[#This Row],[Occ ]])*Table2183147[[#This Row],[Det ]]","v":0}]
[null,1,null,null,null,null,null,null,null,null,null,null,null,{"$f":"Table2183147[[#This Row],[Sev]]*Table2183147[[#This Row],[Occ]]","v":0},{"$f":"(Table2183147[[#This Row],[Sev]]*Table2183147[[#This Row],[Occ]])*Table2183147[[#This Row],[Det]]","v":0},null,null,null,null,null,null,{"$f":"Table2183147[[#This Row],[Sev ]]*Table2183147[[#This Row],[Occ ]]","v":0},{"$f":"(Table2183147[[#This Row],[Sev ]]*Table2183147[[#This Row],[Occ ]])*Table2183147[[#This Row],[Det ]]","v":0}]
[null,1,null,null,null,null,null,null,null,null,null,null,null,{"$f":"Table2183147[[#This Row],[Sev]]*Table2183147[[#This Row],[Occ]]","v":0},{"$f":"(Table2183147[[#This Row],[Sev]]*Table2183147[[#This Row],[Occ]])*Table2183147[[#This Row],[Det]]","v":0},null,null,null,null,null,null,{"$f":"Table2183147[[#This Row],[Sev ]]*Table2183147[[#This Row],[Occ ]]","v":0},{"$f":"(Table2183147[[#This Row],[Sev ]]*Table2183147[[#This Row],[Occ ]])*Table2183147[[#This Row],[Det ]]","v":0}]
[null,1,null,null,null,null,null,null,null,null,null,null,null,{"$f":"Table2183147[[#This Row],[Sev]]*Table2183147[[#This Row],[Occ]]","v":0},{"$f":"(Table2183147[[#This Row],[Sev]]*Table2183147[[#This Row],[Occ]])*Table2183147[[#This Row],[Det]]","v":0},null,null,null,null,null,null,{"$f":"Table2183147[[#This Row],[Sev ]]*Table2183147[[#This Row],[Occ ]]","v":0},{"$f":"(Table2183147[[#This Row],[Sev ]]*Table2183147[[#This Row],[Occ ]])*Table2183147[[#This Row],[Det ]]","v":0}]
[null,1,null,null,null,null,null,null,null,null,null,null,null,{"$f":"Table2183147[[#This Row],[Sev]]*Table2183147[[#This Row],[Occ]]","v":0},{"$f":"(Table2183147[[#This Row],[Sev]]*Table2183147[[#This Row],[Occ]])*Table2183147[[#This Row],[Det]]","v":0},null,null,null,null,null,null,{"$f":"Table2183147[[#This Row],[Sev ]]*Table2183147[[#This Row],[Occ ]]","v":0},{"$f":"(Table2183147[[#This Row],[Sev ]]*Table2183147[[#This Row],[Occ ]])*Table2183147[[#This Row],[Det ]]","v":0}]
[null,1,null,null,null,null,null,null,null,null,null,null,null,{"$f":"Table2183147[[#This Row],[Sev]]*Table2183147[[#This Row],[Occ]]","v":0},{"$f":"(Table2183147[[#This Row],[Sev]]*Table2183147[[#This Row],[Occ]])*Table2183147[[#This Row],[Det]]","v":0},null,null,null,null,null,null,{"$f":"Table2183147[[#This Row],[Sev ]]*Table2183147[[#This Row],[Occ ]]","v":0},{"$f":"(Table2183147[[#This Row],[Sev ]]*Table2183147[[#This Row],[Occ ]])*Table2183147[[#This Row],[Det ]]","v":0}]
[null,1,null,null,null,null,null,null,null,null,null,null,null,{"$f":"Table2183147[[#This Row],[Sev]]*Table2183147[[#This Row],[Occ]]","v":0},{"$f":"(Table2183147[[#This Row],[Sev]]*Table2183147[[#This Row],[Occ]])*Table2183147[[#This Row],[Det]]","v":0},null,null,null,null,null,null,{"$f":"Table2183147[[#This Row],[Sev ]]*Table2183147[[#This Row],[Occ ]]","v":0},{"$f":"(Table2183147[[#This Row],[Sev ]]*Table2183147[[#This Row],[Occ ]])*Table2183147[[#This Row],[Det ]]","v":0}]
[null,1]
[null,1]
[null,1]

{"sheet":"4) Part History","index":14,"n_rows":18,"n_cols":13,"rows_kept":18,"cut":false,"hidden":false,"merged":[[15,1,15,6],[5,3,5,4],[6,3,6,4],[7,3,7,4],[8,3,8,4],[9,3,9,4]]}
[]
[]
[]
[null,"GENERAL INFORMATION",null,null,null,null,null,null,"UPLOADS"]
[]
[null,null,null,null,null,null,null,null,"File(s)"]
[]
[]
[]
[]
[]
[null,null,null,null,null,null,null,null,"Attached file(s)",null,null,null,0]
[]
[null,{"$f":"UPPER(\"Sheet specific INFORMATION\")","v":"SHEET SPECIFIC INFORMATION"}]
[]
[null,"Part History"]
[]
[null,"No.","Date\n(dd-mm-yyyy)","ECL","ECL Date\n(dd-mm-yyyy)","Description of Change","Change Reason"]

{"sheet":"5) Customer Engineering Appr.","index":15,"n_rows":34,"n_cols":18,"rows_kept":34,"cut":false,"hidden":false,"merged":[[19,4,19,6],[19,7,19,9],[32,1,32,9],[33,1,33,2],[33,3,33,9],[21,4,21,6],[21,7,21,9],[23,4,23,6],[23,7,23,9],[27,7,27,9],[29,7,29,9],[25,4,25,6],[25,7,25,9],[15,4,15,5],[15,7,15,9],[5,3,5,7],[6,3,6,7],[7,3,7,7],[8,3,8,7],[9,3,9,7],[15,1,15,3]]}
[]
[]
[]
[null,"GENERAL INFORMATION",null,null,null,null,null,null,null,null,null,null,null,null,null,"UPLOADS"]
[]
[null,null,null,null,null,null,null,null,null,null,null,null,null,null,null,"File(s)"]
[]
[]
[]
[]
[]
[null,null,null,null,null,null,null,null,null,null,null,null,null,null,null,"Attached file(s)",null,0]
[]
[null,{"$f":"UPPER(\"Sheet specific INFORMATION\")","v":"SHEET SPECIFIC INFORMATION"}]
[]
[null,"Customer Engineering Approval",null,null,"Customer ",null,null,"Supplier"]
[]
[null,"PPAP Responsible",null,null,{"$f":"VLOOKUP(\"D21\",rng_details,rng_details_input_col,FALSE)","v":0},null,null,{"$f":"VLOOKUP(\"D30\",rng_details,rng_details_input_col,FALSE)","v":0}]
[]
[null,"Responsible Engineer Id"]
[]
[null,"Responsible Engineer Name",null,null,{"$f":"IFERROR(VLOOKUP(E20,tbl_names[],2,FALSE),\"\")","v":""},null,null,{"$f":"IFERROR(VLOOKUP(H20,tbl_names[],2,FALSE),\"\")","v":""}]
[]
[null,"Responsible Engineer Function",null,null,{"$f":"IFERROR(VLOOKUP(E20,tbl_names[],4,FALSE),\"\")","v":""},null,null,{"$f":"IFERROR(VLOOKUP(H20,tbl_names[],4,FALSE),\"\")","v":""}]
[]
[null,"Responsible Engineer Company",null,null,{"$f":"IFERROR(VLOOKUP(E20,tbl_names[],5,FALSE),\"\")","v":""},null,null,{"$f":"IFERROR(VLOOKUP(H20,tbl_names[],5,FALSE),\"\")","v":""}]
[]
[null,"Supplier Part Number"]
[]
[null,"Supplier Part Name"]
[]
[]
[null,"Customer Engineering Approval"]
[null,"Comments / Justification"]

{"sheet":"6) Process Flow Chart","index":16,"n_rows":48,"n_cols":19,"rows_kept":48,"cut":false,"hidden":false,"merged":[[28,3,28,4],[29,3,29,4],[29,5,29,8],[28,9,28,11],[29,9,29,11],[9,7,9,12],[9,15,9,16],[16,3,16,11],[0,16,0,17],[5,7,5,12],[6,7,6,12],[7,7,7,12],[8,7,8,12],[8,15,8,16]]}
[]
[]
[]
[null,null,null,"GENERAL INFORMATION",null,null,null,null,null,null,null,null,null,null,null,null,"UPLOADS"]
[]
[null,null,null,null,null,null,null,null,null,null,null,null,null,null,null,null,"File(s)"]
[]
[]
[]
[]
[]
[null,null,null,null,null,null,null,null,null,null,null,null,null,null,null,null,"Attached file(s)",null,0]
[]
[null,"Section","Validation",{"$f":"UPPER(\"Sheet specific INFORMATION\")","v":"SHEET SPECIFIC INFORMATION"}]
[]
[null,{"$f":"IFERROR(OFFSET(B16,-1,)+1,1)","v":1}]
[null,{"$f":"OFFSET(B17,-1,)","v":1},null,"Process Flow Chart",null,null,null,null,null,null,null,null,"Supplier"]
[null,1]
[null,1,null,"Ref. No."]
[null,1]
[null,1,null,"Control Plan Date "]
[null,1]
[null,1,null,"Revision Number"]
[null,1]
[null,1,null,"Supplier Production Location Name",null,null,null,null,null,null,null,null,{"$f":"VLOOKUP(\"D39\",rng_details,rng_details_input_col,FALSE)","v":0}]
[null,1]
[null,1,null,"Process Responsible Engineer"]
[null,1]
[null,1,null,"ID",null,"Name",null,null,null,"Function",null,null,"Company"]
[null,1,null,null,null,{"$f":"IFERROR(VLOOKUP(D30,tbl_names[],2,FALSE),\"\")","v":""},null,null,null,{"$f":"IFERROR(VLOOKUP(D30,tbl_names[],4,FALSE),\"\")","v":""},null,null,{"$f":"IFERROR(VLOOKUP(D30,tbl_names[],5,FALSE),\"\")","v":""}]
[null,1]
[null,1,null,"Process Flow Diagram"]
[null,1]
[null,1,null,"STEP","Operation*","Transportation*","Storage*","Inspection*","Waiting*","Column1","Column2","Column3","Operation Description","Item #","Key Product Characteristics","Item # ","Key Control Characteristics","Ref. No","*Double click to change"]
[null,1,"v",{"$f":"IFERROR(OFFSET(D35,-1,)+1,1)","v":1}]
[null,1,"v",{"$f":"IFERROR(OFFSET(D36,-1,)+1,1)","v":2}]
[null,1,"v",3]
[null,1,"v",4]
[null,1,"v",5]
[null,1,"v",6]
[null,1,"v",7]
[null,1,"v",8]
[null,1,"v",9]
[null,1,"v",10]
[null,1,"v"]
[null,1,"v"]
[null,1,"v"]
[null,1]

{"sheet":"7) Factory Floor Plan","index":17,"n_rows":27,"n_cols":16,"rows_kept":27,"cut":false,"hidden":false,"merged":[[15,1,15,2],[17,5,17,7],[19,5,19,7],[15,5,15,7],[21,5,21,7],[25,3,25,4],[26,3,26,4],[26,5,26,7],[25,5,25,7],[11,12,11,13],[5,3,5,4],[5,6,5,8],[5,9,5,11],[6,3,6,4],[6,6,6,8],[6,9,6,11],[9,3,9,4],[9,6,9,8],[9,9,9,10],[7,3,7,4],[7,6,7,8],[7,9,7,11],[8,3,8,4],[8,6,8,8],[8,9,8,10]]}
[]
[]
[]
[null,"GENERAL INFORMATION",null,null,null,null,null,null,null,null,null,null,"UPLOADS"]
[]
[null,null,null,null,null,null,null,null,null,null,null,null,"File(s)"]
[]
[]
[]
[]
[]
[null,null,null,null,null,null,null,null,null,null,null,null,"Attached file(s)",null,null,0]
[]
[null,{"$f":"UPPER(\"Sheet specific INFORMATION\")","v":"SHEET SPECIFIC INFORMATION"}]
[]
[null,"Factory Floor Plan",null,null,null,"Supplier"]
[]
[null,"Floor Plan Date "]
[]
[null,"Revision Number"]
[]
[null,"Supplier Production Location Name",null,null,null,{"$f":"VLOOKUP(\"D39\",rng_details,rng_details_input_col,FALSE)","v":0}]
[]
[null,"Process Responsible Engineer"]
[]
[null,"ID","Name","Function",null,"Company"]
[null,null,{"$f":"IFERROR(VLOOKUP(B27,tbl_names[],2,FALSE),\"\")","v":""},{"$f":"IFERROR(VLOOKUP(B27,tbl_names[],4,FALSE),\"\")","v":""},null,{"$f":"IFERROR(VLOOKUP(B27,tbl_names[],5,FALSE),\"\")","v":""}]

{"sheet":"8) P-FMEA","index":18,"n_rows":59,"n_cols":24,"rows_kept":59,"cut":false,"hidden":false,"merged":[[40,17,40,23]]}
[]
[]
[]
[null,null,"GENERAL INFORMATION",null,null,null,null,null,"UPLOADS"]
[]
[null,null,null,null,null,null,null,null,"File(s)"]
[]
[]
[]
[]
[]
[null,null,null,null,null,null,null,null,"Attached file(s)",null,0]
[null,"Section",{"$f":"UPPER(\"Sheet specific INFORMATION\")","v":"SHEET SPECIFIC INFORMATION"}]
[]
[null,{"$f":"IFERROR(OFFSET(B15,-1,),0)+1","v":1}]
[null,{"$f":"OFFSET(B16,-1,)","v":1},"Process Failure Modes and Effects Analysis (PFMEA)\n",null,null,"Supplier"]
[null,{"$f":"OFFSET(B17,-1,)","v":1}]
[null,1,"Ref. No."]
[null,1]
[null,1,"FMEA Date"]
[null,1]
[null,1,"Revision Number."]
[null,1]
[null,1,"Supplier Production Location Name.",null,null,{"$f":"VLOOKUP(\"D39\",rng_details,rng_details_input_col,FALSE)","v":0}]
[null,1]
[null,1,"Responsible Engineer"]
[null,1]
[null,1,"ID","Name","Function","Company"]
[null,1,null,{"$f":"IFERROR(VLOOKUP(C29,tbl_names[],2,FALSE),\"\")","v":""},{"$f":"IFERROR(VLOOKUP(C29,tbl_names[],4,FALSE),\"\")","v":""},{"$f":"IFERROR(VLOOKUP(C29,tbl_names[],5,FALSE),\"\")","v":""}]
[null,1]
[null,1,"Participating"]
[null,1]
[null,1,"ID","Names","Function","Company"]
[null,1,null,{"$f":"IFERROR(VLOOKUP(C34,tbl_names[],2,FALSE),\"\")","v":""},{"$f":"IFERROR(VLOOKUP(C34,tbl_names[],4,FALSE),\"\")","v":""},{"$f":"IFERROR(VLOOKUP(C34,tbl_names[],5,FALSE),\"\")","v":""}]
[null,1,null,{"$f":"IFERROR(VLOOKUP(C35,tbl_names[],2,FALSE),\"\")","v":""},{"$f":"IFERROR(VLOOKUP(C35,tbl_names[],4,FALSE),\"\")","v":""},{"$f":"IFERROR(VLOOKUP(C35,tbl_names[],5,FALSE),\"\")","v":""}]
[null,1,null,{"$f":"IFERROR(VLOOKUP(C36,tbl_names[],2,FALSE),\"\")","v":""},{"$f":"IFERROR(VLOOKUP(C36,tbl_names[],4,FALSE),\"\")","v":""},{"$f":"IFERROR(VLOOKUP(C36,tbl_names[],5,FALSE),\"\")","v":""}]
[null,1,null,{"$f":"IFERROR(VLOOKUP(C37,tbl_names[],2,FALSE),\"\")","v":""},{"$f":"IFERROR(VLOOKUP(C37,tbl_names[],4,FALSE),\"\")","v":""},{"$f":"IFERROR(VLOOKUP(C37,tbl_names[],5,FALSE),\"\")","v":""}]
[null,1,null,{"$f":"IFERROR(VLOOKUP(C38,tbl_names[],2,FALSE),\"\")","v":""},{"$f":"IFERROR(VLOOKUP(C38,tbl_names[],4,FALSE),\"\")","v":""},{"$f":"IFERROR(VLOOKUP(C38,tbl_names[],5,FALSE),\"\")","v":""}]
[null,1]
[null,1]
[null,1,null,null,null,null,null,null,null,null,"Current Process Controls",null,null,null,null,null,null,"Action Results"]
[null,1,"Ref. No.","Process Step/Function","Requirements","Potential Failure Mode","Potential Effect(s) of Failure","Sev","Class","Potential Cause(s)/ Mechanism(s) of Failure","Controls\nPrevention","Occ","Controls\nDetection","Det","R.N.","R.P.N.","Recommended Actions","Responsibility & Target Date","Actions Taken","Sev ","Occ ","Det "," R.N."," R.P.N."]
[null,1,null,null,null,null,null,null,null,null,null,null,null,null,{"$f":"H43*L43","v":0},{"$f":"(Table21[[#This Row],[Sev]]*Table21[[#This Row],[Occ]])*Table21[[#This Row],[Det]]","v":0},null,null,null,null,null,null,{"$f":"T43*U43","v":0},{"$f":"(Table21[[#This Row],[Sev ]]*Table21[[#This Row],[Occ ]])*Table21[[#This Row],[Det ]]","v":0}]
[null,1,null,null,null,null,null,null,null,null,null,null,null,null,0,{"$f":"(Table21[[#This Row],[Sev]]*Table21[[#This Row],[Occ]])*Table21[[#This Row],[Det]]","v":0},null,null,null,null,null,null,0,{"$f":"(Table21[[#This Row],[Sev ]]*Table21[[#This Row],[Occ ]])*Table21[[#This Row],[Det ]]","v":0}]
[null,1,null,null,null,null,null,null,null,null,null,null,null,null,0,{"$f":"(Table21[[#This Row],[Sev]]*Table21[[#This Row],[Occ]])*Table21[[#This Row],[Det]]","v":0},null,null,null,null,null,null,0,{"$f":"(Table21[[#This Row],[Sev ]]*Table21[[#This Row],[Occ ]])*Table21[[#This Row],[Det ]]","v":0}]
[null,1,null,null,null,null,null,null,null,null,null,null,null,null,0,{"$f":"(Table21[[#This Row],[Sev]]*Table21[[#This Row],[Occ]])*Table21[[#This Row],[Det]]","v":0},null,null,null,null,null,null,0,{"$f":"(Table21[[#This Row],[Sev ]]*Table21[[#This Row],[Occ ]])*Table21[[#This Row],[Det ]]","v":0}]
[null,1,null,null,null,null,null,null,null,null,null,null,null,null,0,{"$f":"(Table21[[#This Row],[Sev]]*Table21[[#This Row],[Occ]])*Table21[[#This Row],[Det]]","v":0},null,null,null,null,null,null,0,{"$f":"(Table21[[#This Row],[Sev ]]*Table21[[#This Row],[Occ ]])*Table21[[#This Row],[Det ]]","v":0}]
[null,1,null,null,null,null,null,null,null,null,null,null,null,null,0,{"$f":"(Table21[[#This Row],[Sev]]*Table21[[#This Row],[Occ]])*Table21[[#This Row],[Det]]","v":0},null,null,null,null,null,null,0,{"$f":"(Table21[[#This Row],[Sev ]]*Table21[[#This Row],[Occ ]])*Table21[[#This Row],[Det ]]","v":0}]
[null,1,null,null,null,null,null,null,null,null,null,null,null,null,0,{"$f":"(Table21[[#This Row],[Sev]]*Table21[[#This Row],[Occ]])*Table21[[#This Row],[Det]]","v":0},null,null,null,null,null,null,0,{"$f":"(Table21[[#This Row],[Sev ]]*Table21[[#This Row],[Occ ]])*Table21[[#This Row],[Det ]]","v":0}]
[null,1,null,null,null,null,null,null,null,null,null,null,null,null,0,{"$f":"(Table21[[#This Row],[Sev]]*Table21[[#This Row],[Occ]])*Table21[[#This Row],[Det]]","v":0},null,null,null,null,null,null,0,{"$f":"(Table21[[#This Row],[Sev ]]*Table21[[#This Row],[Occ ]])*Table21[[#This Row],[Det ]]","v":0}]
[null,1,null,null,null,null,null,null,null,null,null,null,null,null,0,{"$f":"(Table21[[#This Row],[Sev]]*Table21[[#This Row],[Occ]])*Table21[[#This Row],[Det]]","v":0},null,null,null,null,null,null,0,{"$f":"(Table21[[#This Row],[Sev ]]*Table21[[#This Row],[Occ ]])*Table21[[#This Row],[Det ]]","v":0}]
[null,1,null,null,null,null,null,null,null,null,null,null,null,null,0,{"$f":"(Table21[[#This Row],[Sev]]*Table21[[#This Row],[Occ]])*Table21[[#This Row],[Det]]","v":0},null,null,null,null,null,null,0,{"$f":"(Table21[[#This Row],[Sev ]]*Table21[[#This Row],[Occ ]])*Table21[[#This Row],[Det ]]","v":0}]
[null,1,null,null,null,null,null,null,null,null,null,null,null,null,0,{"$f":"(Table21[[#This Row],[Sev]]*Table21[[#This Row],[Occ]])*Table21[[#This Row],[Det]]","v":0},null,null,null,null,null,null,0,{"$f":"(Table21[[#This Row],[Sev ]]*Table21[[#This Row],[Occ ]])*Table21[[#This Row],[Det ]]","v":0}]
[null,1,null,null,null,null,null,null,null,null,null,null,null,null,0,{"$f":"(Table21[[#This Row],[Sev]]*Table21[[#This Row],[Occ]])*Table21[[#This Row],[Det]]","v":0},null,null,null,null,null,null,0,{"$f":"(Table21[[#This Row],[Sev ]]*Table21[[#This Row],[Occ ]])*Table21[[#This Row],[Det ]]","v":0}]
[null,1,null,null,null,null,null,null,null,null,null,null,null,null,0,{"$f":"(Table21[[#This Row],[Sev]]*Table21[[#This Row],[Occ]])*Table21[[#This Row],[Det]]","v":0},null,null,null,null,null,null,0,{"$f":"(Table21[[#This Row],[Sev ]]*Table21[[#This Row],[Occ ]])*Table21[[#This Row],[Det ]]","v":0}]
[null,1,null,null,null,null,null,null,null,null,null,null,null,null,0,{"$f":"(Table21[[#This Row],[Sev]]*Table21[[#This Row],[Occ]])*Table21[[#This Row],[Det]]","v":0},null,null,null,null,null,null,0,{"$f":"(Table21[[#This Row],[Sev ]]*Table21[[#This Row],[Occ ]])*Table21[[#This Row],[Det ]]","v":0}]
[null,1,null,null,null,null,null,null,null,null,null,null,null,null,0,{"$f":"(Table21[[#This Row],[Sev]]*Table21[[#This Row],[Occ]])*Table21[[#This Row],[Det]]","v":0},null,null,null,null,null,null,0,{"$f":"(Table21[[#This Row],[Sev ]]*Table21[[#This Row],[Occ ]])*Table21[[#This Row],[Det ]]","v":0}]
[null,1,null,null,null,null,null,null,null,null,null,null,null,null,0,{"$f":"(Table21[[#This Row],[Sev]]*Table21[[#This Row],[Occ]])*Table21[[#This Row],[Det]]","v":0},null,null,null,null,null,null,0,{"$f":"(Table21[[#This Row],[Sev ]]*Table21[[#This Row],[Occ ]])*Table21[[#This Row],[Det ]]","v":0}]
[null,1]

{"sheet":"9) Control Plan","index":19,"n_rows":73,"n_cols":17,"rows_kept":73,"cut":false,"hidden":false,"merged":[[45,5,45,7],[45,12,45,13],[45,15,45,16],[5,5,5,6],[6,5,6,6],[7,5,7,6],[44,2,44,8],[44,9,44,16]]}
[]
[]
[]
[null,null,"GENERAL INFORMATION",null,null,null,"UPLOADS"]
[]
[null,null,null,null,null,null,null,"File(s)"]
[]
[]
[]
[]
[]
[null,null,null,null,null,null,"Attached file(s)",null,0]
[]
[null,"Section",{"$f":"UPPER(\"Sheet specific INFORMATION\")","v":"SHEET SPECIFIC INFORMATION"}]
[]
[null,{"$f":"OFFSET(B16,-1,)+1","v":1}]
[null,{"$f":"OFFSET(B17,-1,)","v":1},"Control Plan",null,"Supplier"]
[null,{"$f":"OFFSET(B18,-1,)","v":1}]
[null,{"$f":"OFFSET(B19,-1,)","v":1},"Ref. No."]
[null,1]
[null,1,"Control Plan Date "]
[null,1]
[null,1,"Revision Number"]
[null,1]
[null,1,"Supplier Production Location Name",null,{"$f":"VLOOKUP(\"D39\",rng_details,rng_details_input_col,FALSE)","v":0}]
[null,1]
[null,{"$f":"OFFSET(B27,-1,)","v":1},"Process Responsible Engineer"]
[null,1]
[null,1,"ID","Name","Function","Company"]
[null,1,null,{"$f":"IFERROR(VLOOKUP(C30,tbl_names[],2,FALSE),\"\")","v":""},{"$f":"IFERROR(VLOOKUP(C30,tbl_names[],4,FALSE),\"\")","v":""},{"$f":"IFERROR(VLOOKUP(C30,tbl_names[],5,FALSE),\"\")","v":""}]
[null,1]
[null,1,"Participating"]
[null,1]
[null,1,"ID","Plan Team Names ","Function"]
[null,1,null,{"$f":"IFERROR(VLOOKUP(C35,tbl_names[],2,FALSE),\"\")","v":""},{"$f":"IFERROR(VLOOKUP(C35,tbl_names[],4,FALSE),\"\")","v":""}]
[null,1,null,{"$f":"IFERROR(VLOOKUP(C36,tbl_names[],2,FALSE),\"\")","v":""},{"$f":"IFERROR(VLOOKUP(C36,tbl_names[],4,FALSE),\"\")","v":""}]
[null,1,null,{"$f":"IFERROR(VLOOKUP(C37,tbl_names[],2,FALSE),\"\")","v":""},{"$f":"IFERROR(VLOOKUP(C37,tbl_names[],4,FALSE),\"\")","v":""}]
[null,1,null,{"$f":"IFERROR(VLOOKUP(C38,tbl_names[],2,FALSE),\"\")","v":""},{"$f":"IFERROR(VLOOKUP(C38,tbl_names[],4,FALSE),\"\")","v":""}]
[null,1,null,{"$f":"IFERROR(VLOOKUP(C39,tbl_names[],2,FALSE),\"\")","v":""},{"$f":"IFERROR(VLOOKUP(C39,tbl_names[],4,FALSE),\"\")","v":""}]
[null,1,null,{"$f":"IFERROR(VLOOKUP(C40,tbl_names[],2,FALSE),\"\")","v":""},{"$f":"IFERROR(VLOOKUP(C40,tbl_names[],4,FALSE),\"\")","v":""}]
[null,1]
[null,1]
[null,1]
[null,1]
[null,1,"General info",null,null,null,null,null,null,"Methods"]
[null,1,null,null,null,"Characteristics",null,null,null,null,null,null,"Sample"]
[null,1,"Ref. no.","Part/Process Number","Process Name/Operation Description","Machine, Device, Jig, Tools, for MFG.","No.","Product","Process","Special Char. Class","Product/Process Specification/Tolerance","Evaluation/ \nMeasurement Technique","Responsibility","Size","Freq.","Control Method","Reaction Plan"]
[null,1]
[null,1]
[null,1]
[null,1]
[null,1]
[null,1]
[null,1]
[null,1]
[null,1]
[null,1]
[null,1]
[null,1]
[null,1]
[null,1]
[null,1]
[null,1]
[null,1]
[null,1]
[null,1]
[null,1]
[null,1]
[null,1]
[null,1]
[null,1]
[null,1]
[null,1]

{"sheet":"10) Process Capability Studies","index":20,"n_rows":43,"n_cols":19,"rows_kept":43,"cut":false,"hidden":false,"merged":[[27,7,27,9],[5,5,5,6],[5,12,5,14],[6,5,6,6],[6,12,6,14],[7,5,7,6],[7,12,7,14],[23,6,23,9],[24,6,24,9],[8,5,8,6],[8,12,8,13],[9,5,9,6],[9,12,9,13],[15,6,15,9],[19,6,19,9],[17,6,17,9]]}
[]
[]
[]
[null,null,null,"GENERAL INFORMATION",null,null,null,null,null,null,null,null,null,null,null,"UPLOADS"]
[]
[null,null,null,null,null,null,null,null,null,null,null,null,null,null,null,"File(s)"]
[]
[]
[]
[]
[]
[null,null,null,null,null,null,null,null,null,null,null,null,null,null,null,"Attached file(s)",null,null,0]
[null,"Section","Validation",{"$f":"UPPER(\"Sheet specific INFORMATION\")","v":"SHEET SPECIFIC INFORMATION"}]
[]
[null,{"$f":"OFFSET(B15,-1,)+1","v":1}]
[null,{"$f":"OFFSET(B16,-1,)","v":1},null,"Process Capability Studies\n",null,null,"Supplier"]
[null,{"$f":"OFFSET(B17,-1,)","v":1}]
[null,1,null,"Ref. No."]
[null,1,null," No"]
[null,1,null,"Supplier Production Location Name",null,null,{"$f":"VLOOKUP(\"D39\",rng_details,rng_details_input_col,FALSE)","v":0}]
[null,1]
[null,1,null,"Responsible Engineer"]
[null,1]
[null,1,null,"ID","Name","Function","Company"]
[null,1,null,null,{"$f":"IFERROR(VLOOKUP(D25,tbl_names[],2,FALSE),\"\")","v":""},{"$f":"IFERROR(VLOOKUP(D25,tbl_names[],4,FALSE),\"\")","v":""},{"$f":"IFERROR(VLOOKUP(D25,tbl_names[],5,FALSE),\"\")","v":""}]
[null,1]
[null,1]
[null,1,null,"Drawing no.","Characteristic","Cp","Cpk","Uploads*",null,null,null,"*Double click to change"]
[null,1,"V"]
[null,1,"V"]
[null,{"$f":"OFFSET(B31,-1,)","v":1},"V"]
[null,1,"V"]
[null,1,"V"]
[null,1,"V"]
[null,1,"V"]
[null,1,"V"]
[null,1,"V"]
[null,1,"V"]
[null,1,"V"]
[null,1,"V"]
[null,1,"V"]
[null,1,"V"]
[null,1]

{"sheet":"11) Performance Test Report","index":21,"n_rows":48,"n_cols":18,"rows_kept":48,"cut":false,"hidden":false,"merged":[[29,9,29,11],[11,17,11,19],[19,5,19,6],[21,5,21,6],[25,5,25,6],[15,5,15,6],[26,5,26,6],[17,5,17,6],[8,4,8,5],[8,8,8,12],[9,4,9,5],[9,8,9,12],[5,4,5,5],[5,8,5,12],[6,4,6,5],[6,8,6,12],[7,4,7,5],[7,8,7,12]]}
[]
[]
[]
[null,null,null,"GENERAL INFORMATION",null,null,null,null,null,null,null,null,null,"UPLOADS"]
[]
[null,null,null,null,null,null,null,null,null,null,null,null,null,"File(s)"]
[]
[]
[]
[]
[]
[null,null,null,null,null,null,null,null,null,null,null,null,null,"Attached file(s)",null,null,null,0]
[null,"Section","Validation",{"$f":"UPPER(\"Sheet specific INFORMATION\")","v":"SHEET SPECIFIC INFORMATION"}]
[]
[null,{"$f":"OFFSET(B15,-1,)+1","v":1}]
[null,{"$f":"OFFSET(B16,-1,)","v":1},null,"Performance Test Report\n",null,"Supplier"]
[null,1]
[null,1,null,"Ref. No."]
[null,1]
[null,1,null,"Supplier Internal Laboratory Information"]
[null,1]
[null,1,null,"External Laboratory Information"]
[null,1]
[null,1,null,"Test Report Approver "]
[null,1]
[null,1,null,"ID","Name","Function",null,"Company"]
[null,1,null,null,{"$f":"IFERROR(VLOOKUP(D27,tbl_names[],2,FALSE),\"\")","v":""},{"$f":"IFERROR(VLOOKUP(D27,tbl_names[],4,FALSE),\"\")","v":""},null,{"$f":"IFERROR(VLOOKUP(D27,tbl_names[],5,FALSE),\"\")","v":""}]
[null,1]
[null,1]
[null,1,null,"Test Specification","Specification Limits","Test date \n(dd-mm-yyyy)","QTY Tested","Supplier Test Results(data)/Test Conditions","Pass/fail","Uploads*",null,null,null,"*Double click to change"]
[null,1,"v"]
[null,1,"v"]
[null,1,"v"]
[null,1,"v"]
[null,1,"v"]
[null,1,"v"]
[null,1,"v"]
[null,1,"v"]
[null,1,"v"]
[null,1,"v"]
[null,1,"v"]
[null,1,"v"]
[null,1,"v"]
[null,1,"v"]
[null,1,"v"]
[null,1,"v"]
[null,1]
[null,1]

{"sheet":"12) Material Test Report","index":22,"n_rows":45,"n_cols":16,"rows_kept":45,"cut":false,"hidden":false,"merged":[[34,8,34,9],[34,4,34,5],[32,4,32,5],[32,8,32,9],[35,4,35,5],[35,8,35,9],[33,4,33,5],[33,8,33,9],[41,4,41,5],[41,8,41,9],[36,4,36,5],[36,8,36,9],[40,4,40,5],[40,8,40,9],[38,4,38,5],[38,8,38,9],[37,4,37,5],[37,8,37,9],[39,4,39,5],[39,8,39,9],[28,11,28,13],[28,4,28,5],[29,4,29,5],[5,8,5,9],[6,8,6,9],[7,8,7,9],[8,8,8,9],[9,8,9,9],[15,6,15,8],[19,6,19,8],[21,6,21,8],[25,4,25,5],[26,4,26,5],[25,6,25,7],[26,6,26,7],[17,6,17,8],[31,4,31,5],[31,8,31,9],[29,8,29,9],[30,4,30,5],[30,8,30,9]]}
[]
[]
[]
[null,null,null,"GENERAL INFORMATION",null,null,null,null,null,null,"UPLOADS"]
[]
[null,null,null,null,null,null,null,null,null,null,"File(s)"]
[]
[]
[]
[]
[]
[null,null,null,null,null,null,null,null,null,null,"Attached file(s)",null,0]
[null,"Section","Validation",{"$f":"UPPER(\"Sheet specific INFORMATION\")","v":"SHEET SPECIFIC INFORMATION"}]
[]
[null,{"$f":"OFFSET(B15,-1,)+1","v":1}]
[null,{"$f":"OFFSET(B16,-1,)","v":1},null,"Material Test Report\n",null,null,"Supplier"]
[null,{"$f":"OFFSET(B17,-1,)","v":1}]
[null,1,null,"Ref. No."]
[null,1]
[null,1,null,"Supplier Internal Laboratory Information"]
[null,1]
[null,1,null,"External Laboratory Information"]
[null,1]
[null,1,null,"Test Report Approver "]
[null,1]
[null,1,null,"ID","Name",null,"Function",null,"Company"]
[null,1,null,null,{"$f":"IFERROR(VLOOKUP(D27,tbl_names[],2,FALSE),\"\")","v":""},null,{"$f":"IFERROR(VLOOKUP(D27,tbl_names[],4,FALSE),\"\")","v":""},null,{"$f":"IFERROR(VLOOKUP(D27,tbl_names[],5,FALSE),\"\")","v":""}]
[null,1]
[null,1,null,"Material spec. no./rev./date","Specification/Limits",null,"Test date\n(dd-mm-yyyy)","QTY Tested","Supplier Test Results (data)",null,"Pass/fail","Uploads*",null,null,null,"*Double click to change"]
[null,1,"v"]
[null,1,"v"]
[null,1,"v"]
[null,1,"v"]
[null,1,"v"]
[null,1,"v"]
[null,1,"v"]
[null,1,"v"]
[null,1,"v"]
[null,1,"v"]
[null,1,"v"]
[null,1,"v"]
[null,1,"v"]
[null,1,"v"]
[null,1]
[null,1]

{"sheet":"13) Dimensional Test Report","index":23,"n_rows":51,"n_cols":12,"rows_kept":51,"cut":false,"hidden":false,"merged":[[25,3,25,4],[25,5,25,6],[26,3,26,4],[26,5,26,6],[15,5,15,7],[19,5,19,7],[21,5,21,7],[17,5,17,7]]}
[]
[]
[]
[null,null,"GENERAL INFORMATION",null,null,null,null,null,null,"UPLOADS"]
[]
[null,null,null,null,null,null,null,null,null,"File(s)"]
[]
[]
[]
[]
[]
[null,null,null,null,null,null,null,null,null,"Attached file(s)",0]
[null,"Section",{"$f":"UPPER(\"Sheet specific INFORMATION\")","v":"SHEET SPECIFIC INFORMATION"}]
[]
[null,{"$f":"OFFSET(B15,-1,)+1","v":1}]
[null,{"$f":"OFFSET(B16,-1,)","v":1},"Dimensional Report\n",null,null,"Supplier"]
[null,{"$f":"OFFSET(B17,-1,)","v":1}]
[null,1,"Ref. No."]
[null,1]
[null,1,"Supplier Internal Laboratory Information"]
[null,1]
[null,1,"External Laboratory Information"]
[null,1]
[null,1,"Test Report Approver"]
[null,1]
[null,1,"ID","Name",null,"Function",null,"Company"]
[null,1,null,{"$f":"IFERROR(VLOOKUP(C27,tbl_names[],2,FALSE),\"\")","v":""},null,{"$f":"IFERROR(VLOOKUP(C27,tbl_names[],4,FALSE),\"\")","v":""},null,{"$f":"IFERROR(VLOOKUP(C27,tbl_names[],5,FALSE),\"\")","v":""}]
[null,1]
[null,1]
[null,1,"Print Zone or Balloon Dwg Ref","Nominal Value","Tol +","Tol -","USL","LSL","Measuring Instrument Used","Actual Value","Pass/Fail","Approval for Out of Spec Dimensions\nRef. no. if any"]
[null,1,null,null,null,null,{"$f":"D31+E31","v":0},{"$f":"D31-F31","v":0}]
[null,1,null,null,null,null,{"$f":"D32+E32","v":0},{"$f":"D32-F32","v":0}]
[null,1,null,null,null,null,0,0]
[null,1,null,null,null,null,0,0]
[null,1,null,null,null,null,0,0]
[null,1,null,null,null,null,0,0]
[null,1,null,null,null,null,0,0]
[null,1,null,null,null,null,{"$f":"D38+E38","v":0},{"$f":"D38-F38","v":0}]
[null,1,null,null,null,null,{"$f":"D39+E39","v":0},{"$f":"D39-F39","v":0}]
[null,1,null,null,null,null,0,0]
[null,1,null,null,null,null,0,0]
[null,1,null,null,null,null,0,0]
[null,1,null,null,null,null,0,0]
[null,1,null,null,null,null,0,0]
[null,1,null,null,null,null,0,0]
[null,1,null,null,null,null,0,0]
[null,1,null,null,null,null,0,0]
[null,1,null,null,null,null,{"$f":"D48+E48","v":0},{"$f":"D48-F48","v":0}]
[null,1,null,null,null,null,{"$f":"D49+E49","v":0},{"$f":"D49-F49","v":0}]
[null,1]
[null,1]

{"sheet":"14) Appearance Approval Report","index":24,"n_rows":45,"n_cols":17,"rows_kept":45,"cut":false,"hidden":false,"merged":[[15,3,15,4],[29,12,29,14]]}
[]
[]
[]
[null,null,null,"GENERAL INFORMATION",null,null,null,null,null,"UPLOADS"]
[]
[null,null,null,null,null,null,null,null,null,"File(s)"]
[]
[]
[]
[]
[]
[null,null,null,null,null,null,null,null,null,"Attached file(s)",0]
[null,"Section","Validation",{"$f":"UPPER(\"Sheet specific INFORMATION\")","v":"SHEET SPECIFIC INFORMATION"}]
[]
[null,{"$f":"OFFSET(B15,-1,)+1","v":1}]
[null,{"$f":"OFFSET(B16,-1,)","v":1},null,"Appearance Approval Report\n",null,"Supplier"]
[null,{"$f":"OFFSET(B17,-1,)","v":1}]
[null,1,null,"Ref. No"]
[null,1]
[null,1,null,"Supplier Internal Laboratory information"]
[null,1]
[null,1,null,"External Laboratory Information"]
[null,1]
[null,1,null,"Test Report Approver"]
[null,1]
[null,1,null,"ID","Name","Function","Company"]
[null,1,null,null,{"$f":"IFERROR(VLOOKUP(D27,tbl_names[],2,FALSE),\"\")","v":""},{"$f":"IFERROR(VLOOKUP(D27,tbl_names[],4,FALSE),\"\")","v":""},{"$f":"IFERROR(VLOOKUP(D27,tbl_names[],5,FALSE),\"\")","v":""}]
[null,1]
[null,1]
[null,1,null,"No.","Appearance topic","Test Specification","Specification/Limits","Test Date","Qty. Tested","Supplier Test Results (Data) Test Conditions","Actual Result (Pass/Fail)","Remarks","Uploads*",null,null,null,"*Double click to change"]
[null,1,"v"]
[null,1,"v"]
[null,1,"v"]
[null,1,"v"]
[null,1,"v"]
[null,1,"v"]
[null,1,"v"]
[null,1,"v"]
[null,1,"v"]
[null,1,"v"]
[null,1,"v"]
[null,1,"v"]
[null,1,"v"]
[null,1,"v"]
[null,1]

{"sheet":"Calc_MSA","index":25,"n_rows":456,"n_cols":15,"rows_kept":456,"cut":false,"hidden":true,"merged":[]}
[]
[]
[null,"MSA SIMPLE"]
[null,null,null,null,null,"STDV",{"$f":"rng_msa_sim_dv1","v":{"$error":"#NAME?"}}]
[null,null,null,"No","data","avarage","UCL","LCL",null,"No.","range","range -","UCL","LCL"]
[null,null,null,1,{"$f":"IF(#REF!<>\"\",#REF!,\"\")","v":{"$error":"#REF!"}},{"$f":"IF(E6<>\"\",AVERAGE(E6:E65),\"\")","v":{"$error":"#REF!"}},{"$f":"+F6+(3*$G$4)","v":{"$error":"#REF!"}},{"$f":"+F6-(3*$G$4)","v":{"$error":"#REF!"}},null,{"$f":"D6","v":1},null,{"$f":"AVERAGE(K7:K65)","v":0},{"$f":"+L6+(3*_xlfn.STDEV.P(K7:K65))","v":0},{"$f":"IF(L6-(3*_xlfn.STDEV.P(K7:K65))<0,0,(L6-(3*_xlfn.STDEV.P(K7:K65))))","v":0}]
[null,null,null,{"$f":"D6+1","v":2},{"$f":"IF(#REF!<>\"\",#REF!,\"\")","v":{"$error":"#REF!"}},{"$f":"F6","v":{"$error":"#REF!"}},{"$f":"+F7+(3*$G$4)","v":{"$error":"#REF!"}},{"$f":"+F7-(3*$G$4)","v":{"$error":"#REF!"}},null,2,{"$f":"IFERROR(ABS(E6-E7),0)","v":0},{"$f":"L6","v":0},0,0]
[null,null,null,{"$f":"D7+1","v":3},{"$f":"IF(#REF!<>\"\",#REF!,\"\")","v":{"$error":"#REF!"}},{"$error":"#REF!"},{"$error":"#REF!"},{"$error":"#REF!"},null,3,0,0,0,0]
[null,null,null,4,{"$f":"IF(#REF!<>\"\",#REF!,\"\")","v":{"$error":"#REF!"}},{"$error":"#REF!"},{"$error":"#REF!"},{"$error":"#REF!"},null,4,0,0,0,0]
[null,null,null,5,{"$f":"IF(#REF!<>\"\",#REF!,\"\")","v":{"$error":"#REF!"}},{"$error":"#REF!"},{"$error":"#REF!"},{"$error":"#REF!"},null,5,0,0,0,0]
[null,null,null,6,{"$f":"IF(#REF!<>\"\",#REF!,\"\")","v":{"$error":"#REF!"}},{"$error":"#REF!"},{"$error":"#REF!"},{"$error":"#REF!"},null,6,0,0,0,0]
[null,null,null,7,{"$f":"IF(#REF!<>\"\",#REF!,\"\")","v":{"$error":"#REF!"}},{"$error":"#REF!"},{"$error":"#REF!"},{"$error":"#REF!"},null,7,0,0,0,0]
[null,null,null,8,{"$f":"IF(#REF!<>\"\",#REF!,\"\")","v":{"$error":"#REF!"}},{"$error":"#REF!"},{"$error":"#REF!"},{"$error":"#REF!"},null,8,0,0,0,0]
[null,null,null,9,{"$f":"IF(#REF!<>\"\",#REF!,\"\")","v":{"$error":"#REF!"}},{"$error":"#REF!"},{"$error":"#REF!"},{"$error":"#REF!"},null,9,0,0,0,0]
[null,null,null,10,{"$f":"IF(#REF!<>\"\",#REF!,\"\")","v":{"$error":"#REF!"}},{"$error":"#REF!"},{"$error":"#REF!"},{"$error":"#REF!"},null,10,0,0,0,0]
[null,null,null,11,{"$f":"IF(#REF!<>\"\",#REF!,\"\")","v":{"$error":"#REF!"}},{"$error":"#REF!"},{"$error":"#REF!"},{"$error":"#REF!"},null,11,0,0,0,0]
[null,null,null,12,{"$f":"IF(#REF!<>\"\",#REF!,\"\")","v":{"$error":"#REF!"}},{"$error":"#REF!"},{"$error":"#REF!"},{"$error":"#REF!"},null,12,0,0,0,0]
[null,null,null,13,{"$f":"IF(#REF!<>\"\",#REF!,\"\")","v":{"$error":"#REF!"}},{"$error":"#REF!"},{"$error":"#REF!"},{"$error":"#REF!"},null,13,0,0,0,0]
[null,null,null,14,{"$f":"IF(#REF!<>\"\",#REF!,\"\")","v":{"$error":"#REF!"}},{"$error":"#REF!"},{"$error":"#REF!"},{"$error":"#REF!"},null,14,0,0,0,0]
[null,null,null,15,{"$f":"IF(#REF!<>\"\",#REF!,\"\")","v":{"$error":"#REF!"}},{"$error":"#REF!"},{"$error":"#REF!"},{"$error":"#REF!"},null,15,0,0,0,0]
[null,null,null,16,{"$f":"IF(#REF!<>\"\",#REF!,\"\")","v":{"$error":"#REF!"}},{"$error":"#REF!"},{"$error":"#REF!"},{"$error":"#REF!"},null,16,0,0,0,0]
[null,null,null,17,{"$f":"IF(#REF!<>\"\",#REF!,\"\")","v":{"$error":"#REF!"}},{"$error":"#REF!"},{"$error":"#REF!"},{"$error":"#REF!"},null,17,0,0,0,0]
[null,null,null,18,{"$f":"IF(#REF!<>\"\",#REF!,\"\")","v":{"$error":"#REF!"}},{"$error":"#REF!"},{"$error":"#REF!"},{"$error":"#REF!"},null,18,0,{"$f":"L22","v":0},0,0]
[null,null,null,19,{"$f":"IF(#REF!<>\"\",#REF!,\"\")","v":{"$error":"#REF!"}},{"$error":"#REF!"},{"$error":"#REF!"},{"$error":"#REF!"},null,19,0,0,0,0]
[null,null,null,20,{"$f":"IF(#REF!<>\"\",#REF!,\"\")","v":{"$error":"#REF!"}},{"$error":"#REF!"},{"$error":"#REF!"},{"$error":"#REF!"},null,20,0,0,0,0]
[null,null,null,21,{"$f":"IF(#REF!<>\"\",#REF!,\"\")","v":{"$error":"#REF!"}},{"$error":"#REF!"},{"$error":"#REF!"},{"$error":"#REF!"},null,21,0,0,0,0]
[null,null,null,22,{"$f":"IF(#REF!<>\"\",#REF!,\"\")","v":{"$error":"#REF!"}},{"$error":"#REF!"},{"$error":"#REF!"},{"$error":"#REF!"},null,22,0,0,0,0]
[null,null,null,23,{"$f":"IF(#REF!<>\"\",#REF!,\"\")","v":{"$error":"#REF!"}},{"$error":"#REF!"},{"$error":"#REF!"},{"$error":"#REF!"},null,23,0,0,0,0]
[null,null,null,24,{"$f":"IF(#REF!<>\"\",#REF!,\"\")","v":{"$error":"#REF!"}},{"$error":"#REF!"},{"$error":"#REF!"},{"$error":"#REF!"},null,24,0,0,0,0]
[null,null,null,25,{"$f":"IF(#REF!<>\"\",#REF!,\"\")","v":{"$error":"#REF!"}},{"$error":"#REF!"},{"$error":"#REF!"},{"$error":"#REF!"},null,25,0,0,0,0]
[null,null,null,26,{"$f":"IF(#REF!<>\"\",#REF!,\"\")","v":{"$error":"#REF!"}},{"$error":"#REF!"},{"$error":"#REF!"},{"$error":"#REF!"},null,26,0,0,0,0]
[null,null,null,27,{"$f":"IF(#REF!<>\"\",#REF!,\"\")","v":{"$error":"#REF!"}},{"$error":"#REF!"},{"$error":"#REF!"},{"$error":"#REF!"},null,27,0,0,0,0]
[null,null,null,28,{"$f":"IF(#REF!<>\"\",#REF!,\"\")","v":{"$error":"#REF!"}},{"$error":"#REF!"},{"$error":"#REF!"},{"$error":"#REF!"},null,28,0,0,0,0]
[null,null,null,29,{"$f":"IF(#REF!<>\"\",#REF!,\"\")","v":{"$error":"#REF!"}},{"$error":"#REF!"},{"$error":"#REF!"},{"$error":"#REF!"},null,29,0,0,0,0]
[null,null,null,30,{"$f":"IF(#REF!<>\"\",#REF!,\"\")","v":{"$error":"#REF!"}},{"$error":"#REF!"},{"$error":"#REF!"},{"$error":"#REF!"},null,30,0,0,0,0]
[null,null,null,31,{"$f":"IF(#REF!<>\"\",#REF!,\"\")","v":{"$error":"#REF!"}},{"$error":"#REF!"},{"$error":"#REF!"},{"$error":"#REF!"},null,31,0,0,0,0]
[null,null,null,32,{"$f":"IF(#REF!<>\"\",#REF!,\"\")","v":{"$error":"#REF!"}},{"$error":"#REF!"},{"$error":"#REF!"},{"$error":"#REF!"},null,32,0,0,0,0]
[null,null,null,33,{"$f":"IF(#REF!<>\"\",#REF!,\"\")","v":{"$error":"#REF!"}},{"$error":"#REF!"},{"$error":"#REF!"},{"$error":"#REF!"},null,33,0,0,0,0]
[null,null,null,34,{"$f":"IF(#REF!<>\"\",#REF!,\"\")","v":{"$error":"#REF!"}},{"$error":"#REF!"},{"$error":"#REF!"},{"$error":"#REF!"},null,34,0,{"$f":"L38","v":0},0,0]
[null,null,null,35,{"$f":"IF(#REF!<>\"\",#REF!,\"\")","v":{"$error":"#REF!"}},{"$error":"#REF!"},{"$error":"#REF!"},{"$error":"#REF!"},null,35,0,0,0,0]
[null,null,null,36,{"$f":"IF(#REF!<>\"\",#REF!,\"\")","v":{"$error":"#REF!"}},{"$error":"#REF!"},{"$error":"#REF!"},{"$error":"#REF!"},null,36,0,0,0,0]
[null,null,null,37,{"$f":"IF(#REF!<>\"\",#REF!,\"\")","v":{"$error":"#REF!"}},{"$error":"#REF!"},{"$error":"#REF!"},{"$error":"#REF!"},null,37,0,0,0,0]
[null,null,null,38,{"$f":"IF(#REF!<>\"\",#REF!,\"\")","v":{"$error":"#REF!"}},{"$error":"#REF!"},{"$error":"#REF!"},{"$error":"#REF!"},null,38,0,0,0,0]
[null,null,null,39,{"$f":"IF(#REF!<>\"\",#REF!,\"\")","v":{"$error":"#REF!"}},{"$error":"#REF!"},{"$error":"#REF!"},{"$error":"#REF!"},null,39,0,0,0,0]
[null,null,null,40,{"$f":"IF(#REF!<>\"\",#REF!,\"\")","v":{"$error":"#REF!"}},{"$error":"#REF!"},{"$error":"#REF!"},{"$error":"#REF!"},null,40,0,0,0,0]
[null,null,null,41,{"$f":"IF(#REF!<>\"\",#REF!,\"\")","v":{"$error":"#REF!"}},{"$error":"#REF!"},{"$error":"#REF!"},{"$error":"#REF!"},null,41,0,0,0,0]
[null,null,null,42,{"$f":"IF(#REF!<>\"\",#REF!,\"\")","v":{"$error":"#REF!"}},{"$error":"#REF!"},{"$error":"#REF!"},{"$error":"#REF!"},null,42,0,0,0,0]
[null,null,null,43,{"$f":"IF(#REF!<>\"\",#REF!,\"\")","v":{"$error":"#REF!"}},{"$error":"#REF!"},{"$error":"#REF!"},{"$error":"#REF!"},null,43,0,0,0,0]
[null,null,null,44,{"$f":"IF(#REF!<>\"\",#REF!,\"\")","v":{"$error":"#REF!"}},{"$error":"#REF!"},{"$error":"#REF!"},{"$error":"#REF!"},null,44,0,0,0,0]
[null,null,null,45,{"$f":"IF(#REF!<>\"\",#REF!,\"\")","v":{"$error":"#REF!"}},{"$error":"#REF!"},{"$error":"#REF!"},{"$error":"#REF!"},null,45,0,0,0,0]
[null,null,null,46,{"$f":"IF(#REF!<>\"\",#REF!,\"\")","v":{"$error":"#REF!"}},{"$error":"#REF!"},{"$error":"#REF!"},{"$error":"#REF!"},null,46,0,0,0,0]
[null,null,null,47,{"$f":"IF(#REF!<>\"\",#REF!,\"\")","v":{"$error":"#REF!"}},{"$error":"#REF!"},{"$error":"#REF!"},{"$error":"#REF!"},null,47,0,0,0,0]
[null,null,null,48,{"$f":"IF(#REF!<>\"\",#REF!,\"\")","v":{"$error":"#REF!"}},{"$error":"#REF!"},{"$error":"#REF!"},{"$error":"#REF!"},null,48,0,0,0,0]
[null,null,null,49,{"$f":"IF(#REF!<>\"\",#REF!,\"\")","v":{"$error":"#REF!"}},{"$error":"#REF!"},{"$error":"#REF!"},{"$error":"#REF!"},null,49,0,0,0,0]
[null,null,null,50,{"$f":"IF(#REF!<>\"\",#REF!,\"\")","v":{"$error":"#REF!"}},{"$error":"#REF!"},{"$error":"#REF!"},{"$error":"#REF!"},null,50,0,{"$f":"L54","v":0},0,0]
[null,null,null,51,{"$f":"IF(#REF!<>\"\",#REF!,\"\")","v":{"$error":"#REF!"}},{"$error":"#REF!"},{"$error":"#REF!"},{"$error":"#REF!"},null,51,0,0,0,0]
[null,null,null,52,{"$f":"IF(#REF!<>\"\",#REF!,\"\")","v":{"$error":"#REF!"}},{"$error":"#REF!"},{"$error":"#REF!"},{"$error":"#REF!"},null,52,0,0,0,0]
[null,null,null,53,{"$f":"IF(#REF!<>\"\",#REF!,\"\")","v":{"$error":"#REF!"}},{"$error":"#REF!"},{"$error":"#REF!"},{"$error":"#REF!"},null,53,0,0,0,0]
[null,null,null,54,{"$f":"IF(#REF!<>\"\",#REF!,\"\")","v":{"$error":"#REF!"}},{"$error":"#REF!"},{"$error":"#REF!"},{"$error":"#REF!"},null,54,0,0,0,0]
[null,null,null,55,{"$f":"IF(#REF!<>\"\",#REF!,\"\")","v":{"$error":"#REF!"}},{"$error":"#REF!"},{"$error":"#REF!"},{"$error":"#REF!"},null,55,0,0,0,0]
[null,null,null,56,{"$f":"IF(#REF!<>\"\",#REF!,\"\")","v":{"$error":"#REF!"}},{"$error":"#REF!"},{"$error":"#REF!"},{"$error":"#REF!"},null,56,0,0,0,0]
[null,null,null,57,{"$f":"IF(#REF!<>\"\",#REF!,\"\")","v":{"$error":"#REF!"}},{"$error":"#REF!"},{"$error":"#REF!"},{"$error":"#REF!"},null,57,0,0,0,0]
[null,null,null,58,{"$f":"IF(#REF!<>\"\",#REF!,\"\")","v":{"$error":"#REF!"}},{"$error":"#REF!"},{"$error":"#REF!"},{"$error":"#REF!"},null,58,0,0,0,0]
[null,null,null,59,{"$f":"IF(#REF!<>\"\",#REF!,\"\")","v":{"$error":"#REF!"}},{"$error":"#REF!"},{"$error":"#REF!"},{"$error":"#REF!"},null,59,0,0,0,0]
[null,null,null,60,{"$f":"IF(#REF!<>\"\",#REF!,\"\")","v":{"$error":"#REF!"}},{"$error":"#REF!"},{"$error":"#REF!"},{"$error":"#REF!"},null,60,0,0,0,0]
[]
[]
[]
[null,null,null,null,null,"STDV",{"$f":"rng_msa_sim_dv2","v":{"$error":"#NAME?"}}]
[null,null,null,"No","data","avarage","UCL","LCL",null,"No.","range","range -","UCL","LCL"]
[null,null,null,1,{"$f":"IF(#REF!<>\"\",#REF!,\"\")","v":{"$error":"#REF!"}},{"$f":"IF(E71<>\"\",AVERAGE(E71:E130),\"\")","v":{"$error":"#REF!"}},{"$f":"+F71+(3*$G$69)","v":{"$error":"#REF!"}},{"$f":"+F71-(3*$G$69)","v":{"$error":"#REF!"}},null,{"$f":"D71","v":1},null,{"$f":"AVERAGE(K72:K130)","v":0},{"$f":"+L71+(3*_xlfn.STDEV.P(K72:K130))","v":0},{"$f":"IF(L71-(3*_xlfn.STDEV.P(K72:K130))<0,0,(L71-(3*_xlfn.STDEV.P(K72:K130))))","v":0}]
[null,null,null,{"$f":"D71+1","v":2},{"$f":"IF(#REF!<>\"\",#REF!,\"\")","v":{"$error":"#REF!"}},{"$f":"F71","v":{"$error":"#REF!"}},{"$f":"+F72+(3*$G$69)","v":{"$error":"#REF!"}},{"$f":"+F72-(3*$G$69)","v":{"$error":"#REF!"}},null,2,{"$f":"IFERROR(ABS(E71-E72),0)","v":0},{"$f":"L71","v":0},0,0]
[null,null,null,{"$f":"D72+1","v":3},{"$f":"IF(#REF!<>\"\",#REF!,\"\")","v":{"$error":"#REF!"}},{"$error":"#REF!"},{"$error":"#REF!"},{"$error":"#REF!"},null,3,0,0,0,0]
[null,null,null,4,{"$f":"IF(#REF!<>\"\",#REF!,\"\")","v":{"$error":"#REF!"}},{"$error":"#REF!"},{"$error":"#REF!"},{"$error":"#REF!"},null,4,0,0,0,0]
[null,null,null,5,{"$f":"IF(#REF!<>\"\",#REF!,\"\")","v":{"$error":"#REF!"}},{"$error":"#REF!"},{"$error":"#REF!"},{"$error":"#REF!"},null,5,0,0,0,0]
[null,null,null,6,{"$f":"IF(#REF!<>\"\",#REF!,\"\")","v":{"$error":"#REF!"}},{"$error":"#REF!"},{"$error":"#REF!"},{"$error":"#REF!"},null,6,0,0,0,0]
[null,null,null,7,{"$f":"IF(#REF!<>\"\",#REF!,\"\")","v":{"$error":"#REF!"}},{"$error":"#REF!"},{"$error":"#REF!"},{"$error":"#REF!"},null,7,0,0,0,0]
[null,null,null,8,{"$f":"IF(#REF!<>\"\",#REF!,\"\")","v":{"$error":"#REF!"}},{"$error":"#REF!"},{"$error":"#REF!"},{"$error":"#REF!"},null,8,0,0,0,0]
[null,null,null,9,{"$f":"IF(#REF!<>\"\",#REF!,\"\")","v":{"$error":"#REF!"}},{"$error":"#REF!"},{"$error":"#REF!"},{"$error":"#REF!"},null,9,0,0,0,0]
[null,null,null,10,{"$f":"IF(#REF!<>\"\",#REF!,\"\")","v":{"$error":"#REF!"}},{"$error":"#REF!"},{"$error":"#REF!"},{"$error":"#REF!"},null,10,0,0,0,0]
[null,null,null,11,{"$f":"IF(#REF!<>\"\",#REF!,\"\")","v":{"$error":"#REF!"}},{"$error":"#REF!"},{"$error":"#REF!"},{"$error":"#REF!"},null,11,0,0,0,0]
[null,null,null,12,{"$f":"IF(#REF!<>\"\",#REF!,\"\")","v":{"$error":"#REF!"}},{"$error":"#REF!"},{"$error":"#REF!"},{"$error":"#REF!"},null,12,0,0,0,0]
[null,null,null,13,{"$f":"IF(#REF!<>\"\",#REF!,\"\")","v":{"$error":"#REF!"}},{"$error":"#REF!"},{"$error":"#REF!"},{"$error":"#REF!"},null,13,0,0,0,0]
[null,null,null,14,{"$f":"IF(#REF!<>\"\",#REF!,\"\")","v":{"$error":"#REF!"}},{"$error":"#REF!"},{"$error":"#REF!"},{"$error":"#REF!"},null,14,0,0,0,0]
[null,null,null,15,{"$f":"IF(#REF!<>\"\",#REF!,\"\")","v":{"$error":"#REF!"}},{"$error":"#REF!"},{"$error":"#REF!"},{"$error":"#REF!"},null,15,0,0,0,0]
[null,null,null,16,{"$f":"IF(#REF!<>\"\",#REF!,\"\")","v":{"$error":"#REF!"}},{"$error":"#REF!"},{"$error":"#REF!"},{"$error":"#REF!"},null,16,0,0,0,0]
[null,null,null,17,{"$f":"IF(#REF!<>\"\",#REF!,\"\")","v":{"$error":"#REF!"}},{"$error":"#REF!"},{"$error":"#REF!"},{"$error":"#REF!"},null,17,0,0,0,0]
[null,null,null,18,{"$f":"IF(#REF!<>\"\",#REF!,\"\")","v":{"$error":"#REF!"}},{"$error":"#REF!"},{"$error":"#REF!"},{"$error":"#REF!"},null,18,0,{"$f":"L87","v":0},0,0]
[null,null,null,19,{"$f":"IF(#REF!<>\"\",#REF!,\"\")","v":{"$error":"#REF!"}},{"$error":"#REF!"},{"$error":"#REF!"},{"$error":"#REF!"},null,19,0,0,0,0]
[null,null,null,20,{"$f":"IF(#REF!<>\"\",#REF!,\"\")","v":{"$error":"#REF!"}},{"$error":"#REF!"},{"$error":"#REF!"},{"$error":"#REF!"},null,20,0,0,0,0]
[null,null,null,21,{"$f":"IF(#REF!<>\"\",#REF!,\"\")","v":{"$error":"#REF!"}},{"$error":"#REF!"},{"$error":"#REF!"},{"$error":"#REF!"},null,21,0,0,0,0]
[null,null,null,22,{"$f":"IF(#REF!<>\"\",#REF!,\"\")","v":{"$error":"#REF!"}},{"$error":"#REF!"},{"$error":"#REF!"},{"$error":"#REF!"},null,22,0,0,0,0]
[null,null,null,23,{"$f":"IF(#REF!<>\"\",#REF!,\"\")","v":{"$error":"#REF!"}},{"$error":"#REF!"},{"$error":"#REF!"},{"$error":"#REF!"},null,23,0,0,0,0]
[null,null,null,24,{"$f":"IF(#REF!<>\"\",#REF!,\"\")","v":{"$error":"#REF!"}},{"$error":"#REF!"},{"$error":"#REF!"},{"$error":"#REF!"},null,24,0,0,0,0]
[null,null,null,25,{"$f":"IF(#REF!<>\"\",#REF!,\"\")","v":{"$error":"#REF!"}},{"$error":"#REF!"},{"$error":"#REF!"},{"$error":"#REF!"},null,25,0,0,0,0]
[null,null,null,26,{"$f":"IF(#REF!<>\"\",#REF!,\"\")","v":{"$error":"#REF!"}},{"$error":"#REF!"},{"$error":"#REF!"},{"$error":"#REF!"},null,26,0,0,0,0]
[null,null,null,27,{"$f":"IF(#REF!<>\"\",#REF!,\"\")","v":{"$error":"#REF!"}},{"$error":"#REF!"},{"$error":"#REF!"},{"$error":"#REF!"},null,27,0,0,0,0]
[null,null,null,28,{"$f":"IF(#REF!<>\"\",#REF!,\"\")","v":{"$error":"#REF!"}},{"$error":"#REF!"},{"$error":"#REF!"},{"$error":"#REF!"},null,28,0,0,0,0]
[null,null,null,29,{"$f":"IF(#REF!<>\"\",#REF!,\"\")","v":{"$error":"#REF!"}},{"$error":"#REF!"},{"$error":"#REF!"},{"$error":"#REF!"},null,29,0,0,0,0]
[null,null,null,30,{"$f":"IF(#REF!<>\"\",#REF!,\"\")","v":{"$error":"#REF!"}},{"$error":"#REF!"},{"$error":"#REF!"},{"$error":"#REF!"},null,30,0,0,0,0]
[null,null,null,31,{"$f":"IF(#REF!<>\"\",#REF!,\"\")","v":{"$error":"#REF!"}},{"$error":"#REF!"},{"$error":"#REF!"},{"$error":"#REF!"},null,31,0,0,0,0]
[null,null,null,32,{"$f":"IF(#REF!<>\"\",#REF!,\"\")","v":{"$error":"#REF!"}},{"$error":"#REF!"},{"$error":"#REF!"},{"$error":"#REF!"},null,32,0,0,0,0]
[null,null,null,33,{"$f":"IF(#REF!<>\"\",#REF!,\"\")","v":{"$error":"#REF!"}},{"$error":"#REF!"},{"$error":"#REF!"},{"$error":"#REF!"},null,33,0,0,0,0]
[null,null,null,34,{"$f":"IF(#REF!<>\"\",#REF!,\"\")","v":{"$error":"#REF!"}},{"$error":"#REF!"},{"$error":"#REF!"},{"$error":"#REF!"},null,34,0,{"$f":"L103","v":0},0,0]
[null,null,null,35,{"$f":"IF(#REF!<>\"\",#REF!,\"\")","v":{"$error":"#REF!"}},{"$error":"#REF!"},{"$error":"#REF!"},{"$error":"#REF!"},null,35,0,0,0,0]
[null,null,null,36,{"$f":"IF(#REF!<>\"\",#REF!,\"\")","v":{"$error":"#REF!"}},{"$error":"#REF!"},{"$error":"#REF!"},{"$error":"#REF!"},null,36,0,0,0,0]
[null,null,null,37,{"$f":"IF(#REF!<>\"\",#REF!,\"\")","v":{"$error":"#REF!"}},{"$error":"#REF!"},{"$error":"#REF!"},{"$error":"#REF!"},null,37,0,0,0,0]
[null,null,null,38,{"$f":"IF(#REF!<>\"\",#REF!,\"\")","v":{"$error":"#REF!"}},{"$error":"#REF!"},{"$error":"#REF!"},{"$error":"#REF!"},null,38,0,0,0,0]
[null,null,null,39,{"$f":"IF(#REF!<>\"\",#REF!,\"\")","v":{"$error":"#REF!"}},{"$error":"#REF!"},{"$error":"#REF!"},{"$error":"#REF!"},null,39,0,0,0,0]
[null,null,null,40,{"$f":"IF(#REF!<>\"\",#REF!,\"\")","v":{"$error":"#REF!"}},{"$error":"#REF!"},{"$error":"#REF!"},{"$error":"#REF!"},null,40,0,0,0,0]
[null,null,null,41,{"$f":"IF(#REF!<>\"\",#REF!,\"\")","v":{"$error":"#REF!"}},{"$error":"#REF!"},{"$error":"#REF!"},{"$error":"#REF!"},null,41,0,0,0,0]
[null,null,null,42,{"$f":"IF(#REF!<>\"\",#REF!,\"\")","v":{"$error":"#REF!"}},{"$error":"#REF!"},{"$error":"#REF!"},{"$error":"#REF!"},null,42,0,0,0,0]
[null,null,null,43,{"$f":"IF(#REF!<>\"\",#REF!,\"\")","v":{"$error":"#REF!"}},{"$error":"#REF!"},{"$error":"#REF!"},{"$error":"#REF!"},null,43,0,0,0,0]
[null,null,null,44,{"$f":"IF(#REF!<>\"\",#REF!,\"\")","v":{"$error":"#REF!"}},{"$error":"#REF!"},{"$error":"#REF!"},{"$error":"#REF!"},null,44,0,0,0,0]
[null,null,null,45,{"$f":"IF(#REF!<>\"\",#REF!,\"\")","v":{"$error":"#REF!"}},{"$error":"#REF!"},{"$error":"#REF!"},{"$error":"#REF!"},null,45,0,0,0,0]
[null,null,null,46,{"$f":"IF(#REF!<>\"\",#REF!,\"\")","v":{"$error":"#REF!"}},{"$error":"#REF!"},{"$error":"#REF!"},{"$error":"#REF!"},null,46,0,0,0,0]
[null,null,null,47,{"$f":"IF(#REF!<>\"\",#REF!,\"\")","v":{"$error":"#REF!"}},{"$error":"#REF!"},{"$error":"#REF!"},{"$error":"#REF!"},null,47,0,0,0,0]
[null,null,null,48,{"$f":"IF(#REF!<>\"\",#REF!,\"\")","v":{"$error":"#REF!"}},{"$error":"#REF!"},{"$error":"#REF!"},{"$error":"#REF!"},null,48,0,0,0,0]
[null,null,null,49,{"$f":"IF(#REF!<>\"\",#REF!,\"\")","v":{"$error":"#REF!"}},{"$error":"#REF!"},{"$error":"#REF!"},{"$error":"#REF!"},null,49,0,0,0,0]
[null,null,null,50,{"$f":"IF(#REF!<>\"\",#REF!,\"\")","v":{"$error":"#REF!"}},{"$error":"#REF!"},{"$error":"#REF!"},{"$error":"#REF!"},null,50,0,{"$f":"L119","v":0},0,0]
[null,null,null,51,{"$f":"IF(#REF!<>\"\",#REF!,\"\")","v":{"$error":"#REF!"}},{"$error":"#REF!"},{"$error":"#REF!"},{"$error":"#REF!"},null,51,0,0,0,0]
[null,null,null,52,{"$f":"IF(#REF!<>\"\",#REF!,\"\")","v":{"$error":"#REF!"}},{"$error":"#REF!"},{"$error":"#REF!"},{"$error":"#REF!"},null,52,0,0,0,0]
[null,null,null,53,{"$f":"IF(#REF!<>\"\",#REF!,\"\")","v":{"$error":"#REF!"}},{"$error":"#REF!"},{"$error":"#REF!"},{"$error":"#REF!"},null,53,0,0,0,0]
[null,null,null,54,{"$f":"IF(#REF!<>\"\",#REF!,\"\")","v":{"$error":"#REF!"}},{"$error":"#REF!"},{"$error":"#REF!"},{"$error":"#REF!"},null,54,0,0,0,0]
[null,null,null,55,{"$f":"IF(#REF!<>\"\",#REF!,\"\")","v":{"$error":"#REF!"}},{"$error":"#REF!"},{"$error":"#REF!"},{"$error":"#REF!"},null,55,0,0,0,0]
[null,null,null,56,{"$f":"IF(#REF!<>\"\",#REF!,\"\")","v":{"$error":"#REF!"}},{"$error":"#REF!"},{"$error":"#REF!"},{"$error":"#REF!"},null,56,0,0,0,0]
[null,null,null,57,{"$f":"IF(#REF!<>\"\",#REF!,\"\")","v":{"$error":"#REF!"}},{"$error":"#REF!"},{"$error":"#REF!"},{"$error":"#REF!"},null,57,0,0,0,0]
[null,null,null,58,{"$f":"IF(#REF!<>\"\",#REF!,\"\")","v":{"$error":"#REF!"}},{"$error":"#REF!"},{"$error":"#REF!"},{"$error":"#REF!"},null,58,0,0,0,0]
[null,null,null,59,{"$f":"IF(#REF!<>\"\",#REF!,\"\")","v":{"$error":"#REF!"}},{"$error":"#REF!"},{"$error":"#REF!"},{"$error":"#REF!"},null,59,0,0,0,0]
[null,null,null,60,{"$f":"IF(#REF!<>\"\",#REF!,\"\")","v":{"$error":"#REF!"}},{"$error":"#REF!"},{"$error":"#REF!"},{"$error":"#REF!"},null,60,0,0,0,0]
[]
[]
[]
[null,null,null,"MSA 3 SIMPLE",null,"STDV",{"$f":"rng_msa_sim_dv3","v":{"$error":"#NAME?"}}]
[null,null,null,"No","data","avarage","UCL","LCL",null,"No.","range","range -","UCL","LCL"]
[null,null,null,1,{"$f":"IF(#REF!<>\"\",#REF!,\"\")","v":{"$error":"#REF!"}},{"$f":"IF(E136<>\"\",AVERAGE(E136:E195),\"\")","v":{"$error":"#REF!"}},{"$f":"+F136+(3*$G$134)","v":{"$error":"#REF!"}},{"$f":"+F136-(3*$G$134)","v":{"$error":"#REF!"}},null,{"$f":"D136","v":1},null,{"$f":"AVERAGE(K137:K195)","v":0},{"$f":"+L136+(3*_xlfn.STDEV.P(K137:K195))","v":0},{"$f":"IF(L136-(3*_xlfn.STDEV.P(K137:K195))<0,0,(L136-(3*_xlfn.STDEV.P(K137:K195))))","v":0}]
[null,null,null,{"$f":"D136+1","v":2},{"$f":"IF(#REF!<>\"\",#REF!,\"\")","v":{"$error":"#REF!"}},{"$f":"F136","v":{"$error":"#REF!"}},{"$f":"+F137+(3*$G$134)","v":{"$error":"#REF!"}},{"$f":"+F137-(3*$G$134)","v":{"$error":"#REF!"}},null,2,{"$f":"IFERROR(ABS(E136-E137),0)","v":0},{"$f":"L136","v":0},0,0]
[null,null,null,{"$f":"D137+1","v":3},{"$f":"IF(#REF!<>\"\",#REF!,\"\")","v":{"$error":"#REF!"}},{"$error":"#REF!"},{"$error":"#REF!"},{"$error":"#REF!"},null,3,0,0,0,0]
[null,null,null,4,{"$f":"IF(#REF!<>\"\",#REF!,\"\")","v":{"$error":"#REF!"}},{"$error":"#REF!"},{"$error":"#REF!"},{"$error":"#REF!"},null,4,0,0,0,0]
[null,null,null,5,{"$f":"IF(#REF!<>\"\",#REF!,\"\")","v":{"$error":"#REF!"}},{"$error":"#REF!"},{"$error":"#REF!"},{"$error":"#REF!"},null,5,0,0,0,0]
[null,null,null,6,{"$f":"IF(#REF!<>\"\",#REF!,\"\")","v":{"$error":"#REF!"}},{"$error":"#REF!"},{"$error":"#REF!"},{"$error":"#REF!"},null,6,0,0,0,0]
[null,null,null,7,{"$f":"IF(#REF!<>\"\",#REF!,\"\")","v":{"$error":"#REF!"}},{"$error":"#REF!"},{"$error":"#REF!"},{"$error":"#REF!"},null,7,0,0,0,0]
[null,null,null,8,{"$f":"IF(#REF!<>\"\",#REF!,\"\")","v":{"$error":"#REF!"}},{"$error":"#REF!"},{"$error":"#REF!"},{"$error":"#REF!"},null,8,0,0,0,0]
[null,null,null,9,{"$f":"IF(#REF!<>\"\",#REF!,\"\")","v":{"$error":"#REF!"}},{"$error":"#REF!"},{"$error":"#REF!"},{"$error":"#REF!"},null,9,0,0,0,0]
[null,null,null,10,{"$f":"IF(#REF!<>\"\",#REF!,\"\")","v":{"$error":"#REF!"}},{"$error":"#REF!"},{"$error":"#REF!"},{"$error":"#REF!"},null,10,0,0,0,0]
[null,null,null,11,{"$f":"IF(#REF!<>\"\",#REF!,\"\")","v":{"$error":"#REF!"}},{"$error":"#REF!"},{"$error":"#REF!"},{"$error":"#REF!"},null,11,0,0,0,0]
[null,null,null,12,{"$f":"IF(#REF!<>\"\",#REF!,\"\")","v":{"$error":"#REF!"}},{"$error":"#REF!"},{"$error":"#REF!"},{"$error":"#REF!"},null,12,0,0,0,0]
[null,null,null,13,{"$f":"IF(#REF!<>\"\",#REF!,\"\")","v":{"$error":"#REF!"}},{"$error":"#REF!"},{"$error":"#REF!"},{"$error":"#REF!"},null,13,0,0,0,0]
[null,null,null,14,{"$f":"IF(#REF!<>\"\",#REF!,\"\")","v":{"$error":"#REF!"}},{"$error":"#REF!"},{"$error":"#REF!"},{"$error":"#REF!"},null,14,0,0,0,0]
[null,null,null,15,{"$f":"IF(#REF!<>\"\",#REF!,\"\")","v":{"$error":"#REF!"}},{"$error":"#REF!"},{"$error":"#REF!"},{"$error":"#REF!"},null,15,0,0,0,0]
[null,null,null,16,{"$f":"IF(#REF!<>\"\",#REF!,\"\")","v":{"$error":"#REF!"}},{"$error":"#REF!"},{"$error":"#REF!"},{"$error":"#REF!"},null,16,0,0,0,0]
[null,null,null,17,{"$f":"IF(#REF!<>\"\",#REF!,\"\")","v":{"$error":"#REF!"}},{"$error":"#REF!"},{"$error":"#REF!"},{"$error":"#REF!"},null,17,0,0,0,0]
[null,null,null,18,{"$f":"IF(#REF!<>\"\",#REF!,\"\")","v":{"$error":"#REF!"}},{"$error":"#REF!"},{"$error":"#REF!"},{"$error":"#REF!"},null,18,0,{"$f":"L152","v":0},0,0]
[null,null,null,19,{"$f":"IF(#REF!<>\"\",#REF!,\"\")","v":{"$error":"#REF!"}},{"$error":"#REF!"},{"$error":"#REF!"},{"$error":"#REF!"},null,19,0,0,0,0]
[null,null,null,20,{"$f":"IF(#REF!<>\"\",#REF!,\"\")","v":{"$error":"#REF!"}},{"$error":"#REF!"},{"$error":"#REF!"},{"$error":"#REF!"},null,20,0,0,0,0]
[null,null,null,21,{"$f":"IF(#REF!<>\"\",#REF!,\"\")","v":{"$error":"#REF!"}},{"$error":"#REF!"},{"$error":"#REF!"},{"$error":"#REF!"},null,21,0,0,0,0]
[null,null,null,22,{"$f":"IF(#REF!<>\"\",#REF!,\"\")","v":{"$error":"#REF!"}},{"$error":"#REF!"},{"$error":"#REF!"},{"$error":"#REF!"},null,22,0,0,0,0]
[null,null,null,23,{"$f":"IF(#REF!<>\"\",#REF!,\"\")","v":{"$error":"#REF!"}},{"$error":"#REF!"},{"$error":"#REF!"},{"$error":"#REF!"},null,23,0,0,0,0]
[null,null,null,24,{"$f":"IF(#REF!<>\"\",#REF!,\"\")","v":{"$error":"#REF!"}},{"$error":"#REF!"},{"$error":"#REF!"},{"$error":"#REF!"},null,24,0,0,0,0]
[null,null,null,25,{"$f":"IF(#REF!<>\"\",#REF!,\"\")","v":{"$error":"#REF!"}},{"$error":"#REF!"},{"$error":"#REF!"},{"$error":"#REF!"},null,25,0,0,0,0]
[null,null,null,26,{"$f":"IF(#REF!<>\"\",#REF!,\"\")","v":{"$error":"#REF!"}},{"$error":"#REF!"},{"$error":"#REF!"},{"$error":"#REF!"},null,26,0,0,0,0]
[null,null,null,27,{"$f":"IF(#REF!<>\"\",#REF!,\"\")","v":{"$error":"#REF!"}},{"$error":"#REF!"},{"$error":"#REF!"},{"$error":"#REF!"},null,27,0,0,0,0]
[null,null,null,28,{"$f":"IF(#REF!<>\"\",#REF!,\"\")","v":{"$error":"#REF!"}},{"$error":"#REF!"},{"$error":"#REF!"},{"$error":"#REF!"},null,28,0,0,0,0]
[null,null,null,29,{"$f":"IF(#REF!<>\"\",#REF!,\"\")","v":{"$error":"#REF!"}},{"$error":"#REF!"},{"$error":"#REF!"},{"$error":"#REF!"},null,29,0,0,0,0]
[null,null,null,30,{"$f":"IF(#REF!<>\"\",#REF!,\"\")","v":{"$error":"#REF!"}},{"$error":"#REF!"},{"$error":"#REF!"},{"$error":"#REF!"},null,30,0,0,0,0]
[null,null,null,31,{"$f":"IF(#REF!<>\"\",#REF!,\"\")","v":{"$error":"#REF!"}},{"$error":"#REF!"},{"$error":"#REF!"},{"$error":"#REF!"},null,31,0,0,0,0]
[null,null,null,32,{"$f":"IF(#REF!<>\"\",#REF!,\"\")","v":{"$error":"#REF!"}},{"$error":"#REF!"},{"$error":"#REF!"},{"$error":"#REF!"},null,32,0,0,0,0]
[null,null,null,33,{"$f":"IF(#REF!<>\"\",#REF!,\"\")","v":{"$error":"#REF!"}},{"$error":"#REF!"},{"$error":"#REF!"},{"$error":"#REF!"},null,33,0,0,0,0]
[null,null,null,34,{"$f":"IF(#REF!<>\"\",#REF!,\"\")","v":{"$error":"#REF!"}},{"$error":"#REF!"},{"$error":"#REF!"},{"$error":"#REF!"},null,34,0,{"$f":"L168","v":0},0,0]
[null,null,null,35,{"$f":"IF(#REF!<>\"\",#REF!,\"\")","v":{"$error":"#REF!"}},{"$error":"#REF!"},{"$error":"#REF!"},{"$error":"#REF!"},null,35,0,0,0,0]
[null,null,null,36,{"$f":"IF(#REF!<>\"\",#REF!,\"\")","v":{"$error":"#REF!"}},{"$error":"#REF!"},{"$error":"#REF!"},{"$error":"#REF!"},null,36,0,0,0,0]
[null,null,null,37,{"$f":"IF(#REF!<>\"\",#REF!,\"\")","v":{"$error":"#REF!"}},{"$error":"#REF!"},{"$error":"#REF!"},{"$error":"#REF!"},null,37,0,0,0,0]
[null,null,null,38,{"$f":"IF(#REF!<>\"\",#REF!,\"\")","v":{"$error":"#REF!"}},{"$error":"#REF!"},{"$error":"#REF!"},{"$error":"#REF!"},null,38,0,0,0,0]
[null,null,null,39,{"$f":"IF(#REF!<>\"\",#REF!,\"\")","v":{"$error":"#REF!"}},{"$error":"#REF!"},{"$error":"#REF!"},{"$error":"#REF!"},null,39,0,0,0,0]
[null,null,null,40,{"$f":"IF(#REF!<>\"\",#REF!,\"\")","v":{"$error":"#REF!"}},{"$error":"#REF!"},{"$error":"#REF!"},{"$error":"#REF!"},null,40,0,0,0,0]
[null,null,null,41,{"$f":"IF(#REF!<>\"\",#REF!,\"\")","v":{"$error":"#REF!"}},{"$error":"#REF!"},{"$error":"#REF!"},{"$error":"#REF!"},null,41,0,0,0,0]
[null,null,null,42,{"$f":"IF(#REF!<>\"\",#REF!,\"\")","v":{"$error":"#REF!"}},{"$error":"#REF!"},{"$error":"#REF!"},{"$error":"#REF!"},null,42,0,0,0,0]
[null,null,null,43,{"$f":"IF(#REF!<>\"\",#REF!,\"\")","v":{"$error":"#REF!"}},{"$error":"#REF!"},{"$error":"#REF!"},{"$error":"#REF!"},null,43,0,0,0,0]
[null,null,null,44,{"$f":"IF(#REF!<>\"\",#REF!,\"\")","v":{"$error":"#REF!"}},{"$error":"#REF!"},{"$error":"#REF!"},{"$error":"#REF!"},null,44,0,0,0,0]
[null,null,null,45,{"$f":"IF(#REF!<>\"\",#REF!,\"\")","v":{"$error":"#REF!"}},{"$error":"#REF!"},{"$error":"#REF!"},{"$error":"#REF!"},null,45,0,0,0,0]
[null,null,null,46,{"$f":"IF(#REF!<>\"\",#REF!,\"\")","v":{"$error":"#REF!"}},{"$error":"#REF!"},{"$error":"#REF!"},{"$error":"#REF!"},null,46,0,0,0,0]
[null,null,null,47,{"$f":"IF(#REF!<>\"\",#REF!,\"\")","v":{"$error":"#REF!"}},{"$error":"#REF!"},{"$error":"#REF!"},{"$error":"#REF!"},null,47,0,0,0,0]
[null,null,null,48,{"$f":"IF(#REF!<>\"\",#REF!,\"\")","v":{"$error":"#REF!"}},{"$error":"#REF!"},{"$error":"#REF!"},{"$error":"#REF!"},null,48,0,0,0,0]
[null,null,null,49,{"$f":"IF(#REF!<>\"\",#REF!,\"\")","v":{"$error":"#REF!"}},{"$error":"#REF!"},{"$error":"#REF!"},{"$error":"#REF!"},null,49,0,0,0,0]
[null,null,null,50,{"$f":"IF(#REF!<>\"\",#REF!,\"\")","v":{"$error":"#REF!"}},{"$error":"#REF!"},{"$error":"#REF!"},{"$error":"#REF!"},null,50,0,{"$f":"L184","v":0},0,0]
[null,null,null,51,{"$f":"IF(#REF!<>\"\",#REF!,\"\")","v":{"$error":"#REF!"}},{"$error":"#REF!"},{"$error":"#REF!"},{"$error":"#REF!"},null,51,0,0,0,0]
[null,null,null,52,{"$f":"IF(#REF!<>\"\",#REF!,\"\")","v":{"$error":"#REF!"}},{"$error":"#REF!"},{"$error":"#REF!"},{"$error":"#REF!"},null,52,0,0,0,0]
[null,null,null,53,{"$f":"IF(#REF!<>\"\",#REF!,\"\")","v":{"$error":"#REF!"}},{"$error":"#REF!"},{"$error":"#REF!"},{"$error":"#REF!"},null,53,0,0,0,0]
[null,null,null,54,{"$f":"IF(#REF!<>\"\",#REF!,\"\")","v":{"$error":"#REF!"}},{"$error":"#REF!"},{"$error":"#REF!"},{"$error":"#REF!"},null,54,0,0,0,0]
[null,null,null,55,{"$f":"IF(#REF!<>\"\",#REF!,\"\")","v":{"$error":"#REF!"}},{"$error":"#REF!"},{"$error":"#REF!"},{"$error":"#REF!"},null,55,0,0,0,0]
[null,null,null,56,{"$f":"IF(#REF!<>\"\",#REF!,\"\")","v":{"$error":"#REF!"}},{"$error":"#REF!"},{"$error":"#REF!"},{"$error":"#REF!"},null,56,0,0,0,0]
[null,null,null,57,{"$f":"IF(#REF!<>\"\",#REF!,\"\")","v":{"$error":"#REF!"}},{"$error":"#REF!"},{"$error":"#REF!"},{"$error":"#REF!"},null,57,0,0,0,0]
[null,null,null,58,{"$f":"IF(#REF!<>\"\",#REF!,\"\")","v":{"$error":"#REF!"}},{"$error":"#REF!"},{"$error":"#REF!"},{"$error":"#REF!"},null,58,0,0,0,0]
[null,null,null,59,{"$f":"IF(#REF!<>\"\",#REF!,\"\")","v":{"$error":"#REF!"}},{"$error":"#REF!"},{"$error":"#REF!"},{"$error":"#REF!"},null,59,0,0,0,0]
[null,null,null,60,{"$f":"IF(#REF!<>\"\",#REF!,\"\")","v":{"$error":"#REF!"}},{"$error":"#REF!"},{"$error":"#REF!"},{"$error":"#REF!"},null,60,0,0,0,0]
[]
[]
[null,null,null,"MSA 4 SIMPLE",null,"STDV",{"$f":"rng_msa_sim_dv4","v":{"$error":"#NAME?"}}]
[null,null,null,"No","data","avarage","UCL","LCL",null,"No.","range","range -","UCL","LCL"]
[null,null,null,1,{"$f":"IF(#REF!<>\"\",#REF!,\"\")","v":{"$error":"#REF!"}},{"$f":"IF(E200<>\"\",AVERAGE(E200:E259),\"\")","v":{"$error":"#REF!"}},{"$f":"+F200+(3*$G$198)","v":{"$error":"#REF!"}},{"$f":"+F200-(3*$G$198)","v":{"$error":"#REF!"}},null,{"$f":"D200","v":1},null,{"$f":"AVERAGE(K201:K259)","v":0},{"$f":"+L200+(3*_xlfn.STDEV.P(K201:K259))","v":0},{"$f":"IF(L200-(3*_xlfn.STDEV.P(K201:K259))<0,0,(L200-(3*_xlfn.STDEV.P(K201:K259))))","v":0}]
[null,null,null,{"$f":"D200+1","v":2},{"$f":"IF(#REF!<>\"\",#REF!,\"\")","v":{"$error":"#REF!"}},{"$f":"F200","v":{"$error":"#REF!"}},{"$f":"+F201+(3*$G$198)","v":{"$error":"#REF!"}},{"$f":"+F201-(3*$G$198)","v":{"$error":"#REF!"}},null,2,{"$f":"IFERROR(ABS(E200-E201),0)","v":0},{"$f":"L200","v":0},0,0]
[null,null,null,{"$f":"D201+1","v":3},{"$f":"IF(#REF!<>\"\",#REF!,\"\")","v":{"$error":"#REF!"}},{"$error":"#REF!"},{"$error":"#REF!"},{"$error":"#REF!"},null,3,0,0,0,0]
[null,null,null,4,{"$f":"IF(#REF!<>\"\",#REF!,\"\")","v":{"$error":"#REF!"}},{"$error":"#REF!"},{"$error":"#REF!"},{"$error":"#REF!"},null,4,0,0,0,0]
[null,null,null,5,{"$f":"IF(#REF!<>\"\",#REF!,\"\")","v":{"$error":"#REF!"}},{"$error":"#REF!"},{"$error":"#REF!"},{"$error":"#REF!"},null,5,0,0,0,0]
[null,null,null,6,{"$f":"IF(#REF!<>\"\",#REF!,\"\")","v":{"$error":"#REF!"}},{"$error":"#REF!"},{"$error":"#REF!"},{"$error":"#REF!"},null,6,0,0,0,0]
[null,null,null,7,{"$f":"IF(#REF!<>\"\",#REF!,\"\")","v":{"$error":"#REF!"}},{"$error":"#REF!"},{"$error":"#REF!"},{"$error":"#REF!"},null,7,0,0,0,0]
[null,null,null,8,{"$f":"IF(#REF!<>\"\",#REF!,\"\")","v":{"$error":"#REF!"}},{"$error":"#REF!"},{"$error":"#REF!"},{"$error":"#REF!"},null,8,0,0,0,0]
[null,null,null,9,{"$f":"IF(#REF!<>\"\",#REF!,\"\")","v":{"$error":"#REF!"}},{"$error":"#REF!"},{"$error":"#REF!"},{"$error":"#REF!"},null,9,0,0,0,0]
[null,null,null,10,{"$f":"IF(#REF!<>\"\",#REF!,\"\")","v":{"$error":"#REF!"}},{"$error":"#REF!"},{"$error":"#REF!"},{"$error":"#REF!"},null,10,0,0,0,0]
[null,null,null,11,{"$f":"IF(#REF!<>\"\",#REF!,\"\")","v":{"$error":"#REF!"}},{"$error":"#REF!"},{"$error":"#REF!"},{"$error":"#REF!"},null,11,0,0,0,0]
[null,null,null,12,{"$f":"IF(#REF!<>\"\",#REF!,\"\")","v":{"$error":"#REF!"}},{"$error":"#REF!"},{"$error":"#REF!"},{"$error":"#REF!"},null,12,0,0,0,0]
[null,null,null,13,{"$f":"IF(#REF!<>\"\",#REF!,\"\")","v":{"$error":"#REF!"}},{"$error":"#REF!"},{"$error":"#REF!"},{"$error":"#REF!"},null,13,0,0,0,0]
[null,null,null,14,{"$f":"IF(#REF!<>\"\",#REF!,\"\")","v":{"$error":"#REF!"}},{"$error":"#REF!"},{"$error":"#REF!"},{"$error":"#REF!"},null,14,0,0,0,0]
[null,null,null,15,{"$f":"IF(#REF!<>\"\",#REF!,\"\")","v":{"$error":"#REF!"}},{"$error":"#REF!"},{"$error":"#REF!"},{"$error":"#REF!"},null,15,0,0,0,0]
[null,null,null,16,{"$f":"IF(#REF!<>\"\",#REF!,\"\")","v":{"$error":"#REF!"}},{"$error":"#REF!"},{"$error":"#REF!"},{"$error":"#REF!"},null,16,0,0,0,0]
[null,null,null,17,{"$f":"IF(#REF!<>\"\",#REF!,\"\")","v":{"$error":"#REF!"}},{"$error":"#REF!"},{"$error":"#REF!"},{"$error":"#REF!"},null,17,0,0,0,0]
[null,null,null,18,{"$f":"IF(#REF!<>\"\",#REF!,\"\")","v":{"$error":"#REF!"}},{"$error":"#REF!"},{"$error":"#REF!"},{"$error":"#REF!"},null,18,0,{"$f":"L216","v":0},0,0]
[null,null,null,19,{"$f":"IF(#REF!<>\"\",#REF!,\"\")","v":{"$error":"#REF!"}},{"$error":"#REF!"},{"$error":"#REF!"},{"$error":"#REF!"},null,19,0,0,0,0]
[null,null,null,20,{"$f":"IF(#REF!<>\"\",#REF!,\"\")","v":{"$error":"#REF!"}},{"$error":"#REF!"},{"$error":"#REF!"},{"$error":"#REF!"},null,20,0,0,0,0]
[null,null,null,21,{"$f":"IF(#REF!<>\"\",#REF!,\"\")","v":{"$error":"#REF!"}},{"$error":"#REF!"},{"$error":"#REF!"},{"$error":"#REF!"},null,21,0,0,0,0]
[null,null,null,22,{"$f":"IF(#REF!<>\"\",#REF!,\"\")","v":{"$error":"#REF!"}},{"$error":"#REF!"},{"$error":"#REF!"},{"$error":"#REF!"},null,22,0,0,0,0]
[null,null,null,23,{"$f":"IF(#REF!<>\"\",#REF!,\"\")","v":{"$error":"#REF!"}},{"$error":"#REF!"},{"$error":"#REF!"},{"$error":"#REF!"},null,23,0,0,0,0]
[null,null,null,24,{"$f":"IF(#REF!<>\"\",#REF!,\"\")","v":{"$error":"#REF!"}},{"$error":"#REF!"},{"$error":"#REF!"},{"$error":"#REF!"},null,24,0,0,0,0]
[null,null,null,25,{"$f":"IF(#REF!<>\"\",#REF!,\"\")","v":{"$error":"#REF!"}},{"$error":"#REF!"},{"$error":"#REF!"},{"$error":"#REF!"},null,25,0,0,0,0]
[null,null,null,26,{"$f":"IF(#REF!<>\"\",#REF!,\"\")","v":{"$error":"#REF!"}},{"$error":"#REF!"},{"$error":"#REF!"},{"$error":"#REF!"},null,26,0,0,0,0]
[null,null,null,27,{"$f":"IF(#REF!<>\"\",#REF!,\"\")","v":{"$error":"#REF!"}},{"$error":"#REF!"},{"$error":"#REF!"},{"$error":"#REF!"},null,27,0,0,0,0]
[null,null,null,28,{"$f":"IF(#REF!<>\"\",#REF!,\"\")","v":{"$error":"#REF!"}},{"$error":"#REF!"},{"$error":"#REF!"},{"$error":"#REF!"},null,28,0,0,0,0]
[null,null,null,29,{"$f":"IF(#REF!<>\"\",#REF!,\"\")","v":{"$error":"#REF!"}},{"$error":"#REF!"},{"$error":"#REF!"},{"$error":"#REF!"},null,29,0,0,0,0]
[null,null,null,30,{"$f":"IF(#REF!<>\"\",#REF!,\"\")","v":{"$error":"#REF!"}},{"$error":"#REF!"},{"$error":"#REF!"},{"$error":"#REF!"},null,30,0,0,0,0]
[null,null,null,31,{"$f":"IF(#REF!<>\"\",#REF!,\"\")","v":{"$error":"#REF!"}},{"$error":"#REF!"},{"$error":"#REF!"},{"$error":"#REF!"},null,31,0,0,0,0]
[null,null,null,32,{"$f":"IF(#REF!<>\"\",#REF!,\"\")","v":{"$error":"#REF!"}},{"$error":"#REF!"},{"$error":"#REF!"},{"$error":"#REF!"},null,32,0,0,0,0]
[null,null,null,33,{"$f":"IF(#REF!<>\"\",#REF!,\"\")","v":{"$error":"#REF!"}},{"$error":"#REF!"},{"$error":"#REF!"},{"$error":"#REF!"},null,33,0,0,0,0]
[null,null,null,34,{"$f":"IF(#REF!<>\"\",#REF!,\"\")","v":{"$error":"#REF!"}},{"$error":"#REF!"},{"$error":"#REF!"},{"$error":"#REF!"},null,34,0,{"$f":"L232","v":0},0,0]
[null,null,null,35,{"$f":"IF(#REF!<>\"\",#REF!,\"\")","v":{"$error":"#REF!"}},{"$error":"#REF!"},{"$error":"#REF!"},{"$error":"#REF!"},null,35,0,0,0,0]
[null,null,null,36,{"$f":"IF(#REF!<>\"\",#REF!,\"\")","v":{"$error":"#REF!"}},{"$error":"#REF!"},{"$error":"#REF!"},{"$error":"#REF!"},null,36,0,0,0,0]
[null,null,null,37,{"$f":"IF(#REF!<>\"\",#REF!,\"\")","v":{"$error":"#REF!"}},{"$error":"#REF!"},{"$error":"#REF!"},{"$error":"#REF!"},null,37,0,0,0,0]
[null,null,null,38,{"$f":"IF(#REF!<>\"\",#REF!,\"\")","v":{"$error":"#REF!"}},{"$error":"#REF!"},{"$error":"#REF!"},{"$error":"#REF!"},null,38,0,0,0,0]
[null,null,null,39,{"$f":"IF(#REF!<>\"\",#REF!,\"\")","v":{"$error":"#REF!"}},{"$error":"#REF!"},{"$error":"#REF!"},{"$error":"#REF!"},null,39,0,0,0,0]
[null,null,null,40,{"$f":"IF(#REF!<>\"\",#REF!,\"\")","v":{"$error":"#REF!"}},{"$error":"#REF!"},{"$error":"#REF!"},{"$error":"#REF!"},null,40,0,0,0,0]
[null,null,null,41,{"$f":"IF(#REF!<>\"\",#REF!,\"\")","v":{"$error":"#REF!"}},{"$error":"#REF!"},{"$error":"#REF!"},{"$error":"#REF!"},null,41,0,0,0,0]
[null,null,null,42,{"$f":"IF(#REF!<>\"\",#REF!,\"\")","v":{"$error":"#REF!"}},{"$error":"#REF!"},{"$error":"#REF!"},{"$error":"#REF!"},null,42,0,0,0,0]
[null,null,null,43,{"$f":"IF(#REF!<>\"\",#REF!,\"\")","v":{"$error":"#REF!"}},{"$error":"#REF!"},{"$error":"#REF!"},{"$error":"#REF!"},null,43,0,0,0,0]
[null,null,null,44,{"$f":"IF(#REF!<>\"\",#REF!,\"\")","v":{"$error":"#REF!"}},{"$error":"#REF!"},{"$error":"#REF!"},{"$error":"#REF!"},null,44,0,0,0,0]
[null,null,null,45,{"$f":"IF(#REF!<>\"\",#REF!,\"\")","v":{"$error":"#REF!"}},{"$error":"#REF!"},{"$error":"#REF!"},{"$error":"#REF!"},null,45,0,0,0,0]
[null,null,null,46,{"$f":"IF(#REF!<>\"\",#REF!,\"\")","v":{"$error":"#REF!"}},{"$error":"#REF!"},{"$error":"#REF!"},{"$error":"#REF!"},null,46,0,0,0,0]
[null,null,null,47,{"$f":"IF(#REF!<>\"\",#REF!,\"\")","v":{"$error":"#REF!"}},{"$error":"#REF!"},{"$error":"#REF!"},{"$error":"#REF!"},null,47,0,0,0,0]
[null,null,null,48,{"$f":"IF(#REF!<>\"\",#REF!,\"\")","v":{"$error":"#REF!"}},{"$error":"#REF!"},{"$error":"#REF!"},{"$error":"#REF!"},null,48,0,0,0,0]
[null,null,null,49,{"$f":"IF(#REF!<>\"\",#REF!,\"\")","v":{"$error":"#REF!"}},{"$error":"#REF!"},{"$error":"#REF!"},{"$error":"#REF!"},null,49,0,0,0,0]
[null,null,null,50,{"$f":"IF(#REF!<>\"\",#REF!,\"\")","v":{"$error":"#REF!"}},{"$error":"#REF!"},{"$error":"#REF!"},{"$error":"#REF!"},null,50,0,{"$f":"L248","v":0},0,0]
[null,null,null,51,{"$f":"IF(#REF!<>\"\",#REF!,\"\")","v":{"$error":"#REF!"}},{"$error":"#REF!"},{"$error":"#REF!"},{"$error":"#REF!"},null,51,0,0,0,0]
[null,null,null,52,{"$f":"IF(#REF!<>\"\",#REF!,\"\")","v":{"$error":"#REF!"}},{"$error":"#REF!"},{"$error":"#REF!"},{"$error":"#REF!"},null,52,0,0,0,0]
[null,null,null,53,{"$f":"IF(#REF!<>\"\",#REF!,\"\")","v":{"$error":"#REF!"}},{"$error":"#REF!"},{"$error":"#REF!"},{"$error":"#REF!"},null,53,0,0,0,0]
[null,null,null,54,{"$f":"IF(#REF!<>\"\",#REF!,\"\")","v":{"$error":"#REF!"}},{"$error":"#REF!"},{"$error":"#REF!"},{"$error":"#REF!"},null,54,0,0,0,0]
[null,null,null,55,{"$f":"IF(#REF!<>\"\",#REF!,\"\")","v":{"$error":"#REF!"}},{"$error":"#REF!"},{"$error":"#REF!"},{"$error":"#REF!"},null,55,0,0,0,0]
[null,null,null,56,{"$f":"IF(#REF!<>\"\",#REF!,\"\")","v":{"$error":"#REF!"}},{"$error":"#REF!"},{"$error":"#REF!"},{"$error":"#REF!"},null,56,0,0,0,0]
[null,null,null,57,{"$f":"IF(#REF!<>\"\",#REF!,\"\")","v":{"$error":"#REF!"}},{"$error":"#REF!"},{"$error":"#REF!"},{"$error":"#REF!"},null,57,0,0,0,0]
[null,null,null,58,{"$f":"IF(#REF!<>\"\",#REF!,\"\")","v":{"$error":"#REF!"}},{"$error":"#REF!"},{"$error":"#REF!"},{"$error":"#REF!"},null,58,0,0,0,0]
[null,null,null,59,{"$f":"IF(#REF!<>\"\",#REF!,\"\")","v":{"$error":"#REF!"}},{"$error":"#REF!"},{"$error":"#REF!"},{"$error":"#REF!"},null,59,0,0,0,0]
[null,null,null,60,{"$f":"IF(#REF!<>\"\",#REF!,\"\")","v":{"$error":"#REF!"}},{"$error":"#REF!"},{"$error":"#REF!"},{"$error":"#REF!"},null,60,0,0,0,0]
[]
[]
[]
[null,null,null,null,null,"STDV",{"$f":"rng_msa_sim_dv5","v":{"$error":"#NAME?"}}]
[null,null,null,"No","data","avarage","UCL","LCL",null,"No.","range","range -","UCL","LCL"]
[null,null,null,1,{"$f":"IF(#REF!<>\"\",#REF!,\"\")","v":{"$error":"#REF!"}},{"$f":"IF(E265<>\"\",AVERAGE(E265:E324),\"\")","v":{"$error":"#REF!"}},{"$f":"+F265+(3*$G$263)","v":{"$error":"#REF!"}},{"$f":"+F265-(3*$G$263)","v":{"$error":"#REF!"}},null,{"$f":"D265","v":1},null,{"$f":"AVERAGE(K266:K324)","v":0},{"$f":"+L265+(3*_xlfn.STDEV.P(K266:K324))","v":0},{"$f":"IF(L265-(3*_xlfn.STDEV.P(K266:K324))<0,0,(L265-(3*_xlfn.STDEV.P(K266:K324))))","v":0}]
[null,null,null,{"$f":"D265+1","v":2},{"$f":"IF(#REF!<>\"\",#REF!,\"\")","v":{"$error":"#REF!"}},{"$f":"F265","v":{"$error":"#REF!"}},{"$f":"+F266+(3*$G$263)","v":{"$error":"#REF!"}},{"$f":"+F266-(3*$G$263)","v":{"$error":"#REF!"}},null,2,{"$f":"IFERROR(ABS(E265-E266),0)","v":0},{"$f":"L265","v":0},0,0]
[null,null,null,{"$f":"D266+1","v":3},{"$f":"IF(#REF!<>\"\",#REF!,\"\")","v":{"$error":"#REF!"}},{"$error":"#REF!"},{"$error":"#REF!"},{"$error":"#REF!"},null,3,{"$f":"IFERROR(ABS(E266-E267),0)","v":0},0,0,0]
[null,null,null,4,{"$f":"IF(#REF!<>\"\",#REF!,\"\")","v":{"$error":"#REF!"}},{"$error":"#REF!"},{"$error":"#REF!"},{"$error":"#REF!"},null,4,0,0,0,0]
[null,null,null,5,{"$f":"IF(#REF!<>\"\",#REF!,\"\")","v":{"$error":"#REF!"}},{"$error":"#REF!"},{"$error":"#REF!"},{"$error":"#REF!"},null,5,0,0,0,0]
[null,null,null,6,{"$f":"IF(#REF!<>\"\",#REF!,\"\")","v":{"$error":"#REF!"}},{"$error":"#REF!"},{"$error":"#REF!"},{"$error":"#REF!"},null,6,0,0,0,0]
[null,null,null,7,{"$f":"IF(#REF!<>\"\",#REF!,\"\")","v":{"$error":"#REF!"}},{"$error":"#REF!"},{"$error":"#REF!"},{"$error":"#REF!"},null,7,0,0,0,0]
[null,null,null,8,{"$f":"IF(#REF!<>\"\",#REF!,\"\")","v":{"$error":"#REF!"}},{"$error":"#REF!"},{"$error":"#REF!"},{"$error":"#REF!"},null,8,0,0,0,0]
[null,null,null,9,{"$f":"IF(#REF!<>\"\",#REF!,\"\")","v":{"$error":"#REF!"}},{"$error":"#REF!"},{"$error":"#REF!"},{"$error":"#REF!"},null,9,0,0,0,0]
[null,null,null,10,{"$f":"IF(#REF!<>\"\",#REF!,\"\")","v":{"$error":"#REF!"}},{"$error":"#REF!"},{"$error":"#REF!"},{"$error":"#REF!"},null,10,0,0,0,0]
[null,null,null,11,{"$f":"IF(#REF!<>\"\",#REF!,\"\")","v":{"$error":"#REF!"}},{"$error":"#REF!"},{"$error":"#REF!"},{"$error":"#REF!"},null,11,0,0,0,0]
[null,null,null,12,{"$f":"IF(#REF!<>\"\",#REF!,\"\")","v":{"$error":"#REF!"}},{"$error":"#REF!"},{"$error":"#REF!"},{"$error":"#REF!"},null,12,0,0,0,0]
[null,null,null,13,{"$f":"IF(#REF!<>\"\",#REF!,\"\")","v":{"$error":"#REF!"}},{"$error":"#REF!"},{"$error":"#REF!"},{"$error":"#REF!"},null,13,0,0,0,0]
[null,null,null,14,{"$f":"IF(#REF!<>\"\",#REF!,\"\")","v":{"$error":"#REF!"}},{"$error":"#REF!"},{"$error":"#REF!"},{"$error":"#REF!"},null,14,0,0,0,0]
[null,null,null,15,{"$f":"IF(#REF!<>\"\",#REF!,\"\")","v":{"$error":"#REF!"}},{"$error":"#REF!"},{"$error":"#REF!"},{"$error":"#REF!"},null,15,0,0,0,0]
[null,null,null,16,{"$f":"IF(#REF!<>\"\",#REF!,\"\")","v":{"$error":"#REF!"}},{"$error":"#REF!"},{"$error":"#REF!"},{"$error":"#REF!"},null,16,0,0,0,0]
[null,null,null,17,{"$f":"IF(#REF!<>\"\",#REF!,\"\")","v":{"$error":"#REF!"}},{"$error":"#REF!"},{"$error":"#REF!"},{"$error":"#REF!"},null,17,0,0,0,0]
[null,null,null,18,{"$f":"IF(#REF!<>\"\",#REF!,\"\")","v":{"$error":"#REF!"}},{"$error":"#REF!"},{"$error":"#REF!"},{"$error":"#REF!"},null,18,0,{"$f":"L281","v":0},0,0]
[null,null,null,19,{"$f":"IF(#REF!<>\"\",#REF!,\"\")","v":{"$error":"#REF!"}},{"$error":"#REF!"},{"$error":"#REF!"},{"$error":"#REF!"},null,19,0,0,0,0]
[null,null,null,20,{"$f":"IF(#REF!<>\"\",#REF!,\"\")","v":{"$error":"#REF!"}},{"$error":"#REF!"},{"$error":"#REF!"},{"$error":"#REF!"},null,20,0,0,0,0]
[null,null,null,21,{"$f":"IF(#REF!<>\"\",#REF!,\"\")","v":{"$error":"#REF!"}},{"$error":"#REF!"},{"$error":"#REF!"},{"$error":"#REF!"},null,21,0,0,0,0]
[null,null,null,22,{"$f":"IF(#REF!<>\"\",#REF!,\"\")","v":{"$error":"#REF!"}},{"$error":"#REF!"},{"$error":"#REF!"},{"$error":"#REF!"},null,22,0,0,0,0]
[null,null,null,23,{"$f":"IF(#REF!<>\"\",#REF!,\"\")","v":{"$error":"#REF!"}},{"$error":"#REF!"},{"$error":"#REF!"},{"$error":"#REF!"},null,23,0,0,0,0]
[null,null,null,24,{"$f":"IF(#REF!<>\"\",#REF!,\"\")","v":{"$error":"#REF!"}},{"$error":"#REF!"},{"$error":"#REF!"},{"$error":"#REF!"},null,24,0,0,0,0]
[null,null,null,25,{"$f":"IF(#REF!<>\"\",#REF!,\"\")","v":{"$error":"#REF!"}},{"$error":"#REF!"},{"$error":"#REF!"},{"$error":"#REF!"},null,25,0,0,0,0]
[null,null,null,26,{"$f":"IF(#REF!<>\"\",#REF!,\"\")","v":{"$error":"#REF!"}},{"$error":"#REF!"},{"$error":"#REF!"},{"$error":"#REF!"},null,26,0,0,0,0]
[null,null,null,27,{"$f":"IF(#REF!<>\"\",#REF!,\"\")","v":{"$error":"#REF!"}},{"$error":"#REF!"},{"$error":"#REF!"},{"$error":"#REF!"},null,27,0,0,0,0]
[null,null,null,28,{"$f":"IF(#REF!<>\"\",#REF!,\"\")","v":{"$error":"#REF!"}},{"$error":"#REF!"},{"$error":"#REF!"},{"$error":"#REF!"},null,28,0,0,0,0]
[null,null,null,29,{"$f":"IF(#REF!<>\"\",#REF!,\"\")","v":{"$error":"#REF!"}},{"$error":"#REF!"},{"$error":"#REF!"},{"$error":"#REF!"},null,29,0,0,0,0]
[null,null,null,30,{"$f":"IF(#REF!<>\"\",#REF!,\"\")","v":{"$error":"#REF!"}},{"$error":"#REF!"},{"$error":"#REF!"},{"$error":"#REF!"},null,30,0,0,0,0]
[null,null,null,31,{"$f":"IF(#REF!<>\"\",#REF!,\"\")","v":{"$error":"#REF!"}},{"$error":"#REF!"},{"$error":"#REF!"},{"$error":"#REF!"},null,31,0,0,0,0]
[null,null,null,32,{"$f":"IF(#REF!<>\"\",#REF!,\"\")","v":{"$error":"#REF!"}},{"$error":"#REF!"},{"$error":"#REF!"},{"$error":"#REF!"},null,32,0,0,0,0]
[null,null,null,33,{"$f":"IF(#REF!<>\"\",#REF!,\"\")","v":{"$error":"#REF!"}},{"$error":"#REF!"},{"$error":"#REF!"},{"$error":"#REF!"},null,33,0,0,0,0]
[null,null,null,34,{"$f":"IF(#REF!<>\"\",#REF!,\"\")","v":{"$error":"#REF!"}},{"$error":"#REF!"},{"$error":"#REF!"},{"$error":"#REF!"},null,34,0,{"$f":"L297","v":0},0,0]
[null,null,null,35,{"$f":"IF(#REF!<>\"\",#REF!,\"\")","v":{"$error":"#REF!"}},{"$error":"#REF!"},{"$error":"#REF!"},{"$error":"#REF!"},null,35,0,0,0,0]
[null,null,null,36,{"$f":"IF(#REF!<>\"\",#REF!,\"\")","v":{"$error":"#REF!"}},{"$error":"#REF!"},{"$error":"#REF!"},{"$error":"#REF!"},null,36,0,0,0,0]
[null,null,null,37,{"$f":"IF(#REF!<>\"\",#REF!,\"\")","v":{"$error":"#REF!"}},{"$error":"#REF!"},{"$error":"#REF!"},{"$error":"#REF!"},null,37,0,0,0,0]
[null,null,null,38,{"$f":"IF(#REF!<>\"\",#REF!,\"\")","v":{"$error":"#REF!"}},{"$error":"#REF!"},{"$error":"#REF!"},{"$error":"#REF!"},null,38,0,0,0,0]
[null,null,null,39,{"$f":"IF(#REF!<>\"\",#REF!,\"\")","v":{"$error":"#REF!"}},{"$error":"#REF!"},{"$error":"#REF!"},{"$error":"#REF!"},null,39,0,0,0,0]
[null,null,null,40,{"$f":"IF(#REF!<>\"\",#REF!,\"\")","v":{"$error":"#REF!"}},{"$error":"#REF!"},{"$error":"#REF!"},{"$error":"#REF!"},null,40,0,0,0,0]
[null,null,null,41,{"$f":"IF(#REF!<>\"\",#REF!,\"\")","v":{"$error":"#REF!"}},{"$error":"#REF!"},{"$error":"#REF!"},{"$error":"#REF!"},null,41,0,0,0,0]
[null,null,null,42,{"$f":"IF(#REF!<>\"\",#REF!,\"\")","v":{"$error":"#REF!"}},{"$error":"#REF!"},{"$error":"#REF!"},{"$error":"#REF!"},null,42,0,0,0,0]
[null,null,null,43,{"$f":"IF(#REF!<>\"\",#REF!,\"\")","v":{"$error":"#REF!"}},{"$error":"#REF!"},{"$error":"#REF!"},{"$error":"#REF!"},null,43,0,0,0,0]
[null,null,null,44,{"$f":"IF(#REF!<>\"\",#REF!,\"\")","v":{"$error":"#REF!"}},{"$error":"#REF!"},{"$error":"#REF!"},{"$error":"#REF!"},null,44,0,0,0,0]
[null,null,null,45,{"$f":"IF(#REF!<>\"\",#REF!,\"\")","v":{"$error":"#REF!"}},{"$error":"#REF!"},{"$error":"#REF!"},{"$error":"#REF!"},null,45,0,0,0,0]
[null,null,null,46,{"$f":"IF(#REF!<>\"\",#REF!,\"\")","v":{"$error":"#REF!"}},{"$error":"#REF!"},{"$error":"#REF!"},{"$error":"#REF!"},null,46,0,0,0,0]
[null,null,null,47,{"$f":"IF(#REF!<>\"\",#REF!,\"\")","v":{"$error":"#REF!"}},{"$error":"#REF!"},{"$error":"#REF!"},{"$error":"#REF!"},null,47,0,0,0,0]
[null,null,null,48,{"$f":"IF(#REF!<>\"\",#REF!,\"\")","v":{"$error":"#REF!"}},{"$error":"#REF!"},{"$error":"#REF!"},{"$error":"#REF!"},null,48,0,0,0,0]
[null,null,null,49,{"$f":"IF(#REF!<>\"\",#REF!,\"\")","v":{"$error":"#REF!"}},{"$error":"#REF!"},{"$error":"#REF!"},{"$error":"#REF!"},null,49,0,0,0,0]
[null,null,null,50,{"$f":"IF(#REF!<>\"\",#REF!,\"\")","v":{"$error":"#REF!"}},{"$error":"#REF!"},{"$error":"#REF!"},{"$error":"#REF!"},null,50,0,{"$f":"L313","v":0},0,0]
[null,null,null,51,{"$f":"IF(#REF!<>\"\",#REF!,\"\")","v":{"$error":"#REF!"}},{"$error":"#REF!"},{"$error":"#REF!"},{"$error":"#REF!"},null,51,0,0,0,0]
[null,null,null,52,{"$f":"IF(#REF!<>\"\",#REF!,\"\")","v":{"$error":"#REF!"}},{"$error":"#REF!"},{"$error":"#REF!"},{"$error":"#REF!"},null,52,0,0,0,0]
[null,null,null,53,{"$f":"IF(#REF!<>\"\",#REF!,\"\")","v":{"$error":"#REF!"}},{"$error":"#REF!"},{"$error":"#REF!"},{"$error":"#REF!"},null,53,0,0,0,0]
[null,null,null,54,{"$f":"IF(#REF!<>\"\",#REF!,\"\")","v":{"$error":"#REF!"}},{"$error":"#REF!"},{"$error":"#REF!"},{"$error":"#REF!"},null,54,0,0,0,0]
[null,null,null,55,{"$f":"IF(#REF!<>\"\",#REF!,\"\")","v":{"$error":"#REF!"}},{"$error":"#REF!"},{"$error":"#REF!"},{"$error":"#REF!"},null,55,0,0,0,0]
[null,null,null,56,{"$f":"IF(#REF!<>\"\",#REF!,\"\")","v":{"$error":"#REF!"}},{"$error":"#REF!"},{"$error":"#REF!"},{"$error":"#REF!"},null,56,0,0,0,0]
[null,null,null,57,{"$f":"IF(#REF!<>\"\",#REF!,\"\")","v":{"$error":"#REF!"}},{"$error":"#REF!"},{"$error":"#REF!"},{"$error":"#REF!"},null,57,0,0,0,0]
[null,null,null,58,{"$f":"IF(#REF!<>\"\",#REF!,\"\")","v":{"$error":"#REF!"}},{"$error":"#REF!"},{"$error":"#REF!"},{"$error":"#REF!"},null,58,0,0,0,0]
[null,null,null,59,{"$f":"IF(#REF!<>\"\",#REF!,\"\")","v":{"$error":"#REF!"}},{"$error":"#REF!"},{"$error":"#REF!"},{"$error":"#REF!"},null,59,0,0,0,0]
[null,null,null,60,{"$f":"IF(#REF!<>\"\",#REF!,\"\")","v":{"$error":"#REF!"}},{"$error":"#REF!"},{"$error":"#REF!"},{"$error":"#REF!"},null,60,0,0,0,0]
[]
[]
[null,"MSA AVERAGE RANGE",null,null,null,"r","r","r",null,null,null,null,"average","average","average"]
[null,null,null,null,"UCL r",{"$f":"#REF!","v":{"$error":"#REF!"}},{"$f":"#REF!","v":{"$error":"#REF!"}},{"$f":"#REF!","v":{"$error":"#REF!"}},null,"UCL a","LCL a","avarage",{"$f":"#REF!","v":{"$error":"#REF!"}},{"$f":"#REF!","v":{"$error":"#REF!"}},{"$f":"#REF!","v":{"$error":"#REF!"}}]
[null,null,null,1,{"$f":"+#REF!","v":{"$error":"#REF!"}},{"$f":"#REF!","v":{"$error":"#REF!"}},{"$f":"#REF!","v":{"$error":"#REF!"}},{"$f":"#REF!","v":{"$error":"#REF!"}},{"$f":"D329","v":1},{"$f":"#REF!+(3*_xlfn.STDEV.P(#REF!,#REF!,#REF!))","v":{"$error":"#REF!"}},{"$f":"#REF!-(3*_xlfn.STDEV.P(#REF!,#REF!,#REF!))","v":{"$error":"#REF!"}},{"$f":"AVERAGE(#REF!)","v":{"$error":"#REF!"}},{"$f":"#REF!","v":{"$error":"#REF!"}},{"$f":"#REF!","v":{"$error":"#REF!"}},{"$f":"#REF!","v":{"$error":"#REF!"}}]
[null,null,null,2,{"$f":"+#REF!","v":{"$error":"#REF!"}},{"$f":"#REF!","v":{"$error":"#REF!"}},{"$f":"#REF!","v":{"$error":"#REF!"}},{"$f":"#REF!","v":{"$error":"#REF!"}},2,{"$f":"#REF!+(3*_xlfn.STDEV.P(#REF!,#REF!,#REF!))","v":{"$error":"#REF!"}},{"$f":"#REF!-(3*_xlfn.STDEV.P(#REF!,#REF!,#REF!))","v":{"$error":"#REF!"}},{"$f":"AVERAGE(#REF!)","v":{"$error":"#REF!"}},{"$f":"#REF!","v":{"$error":"#REF!"}},{"$f":"#REF!","v":{"$error":"#REF!"}},{"$f":"#REF!","v":{"$error":"#REF!"}}]
[null,null,null,3,{"$f":"+#REF!","v":{"$error":"#REF!"}},{"$f":"#REF!","v":{"$error":"#REF!"}},{"$f":"#REF!","v":{"$error":"#REF!"}},{"$f":"#REF!","v":{"$error":"#REF!"}},3,{"$f":"#REF!+(3*_xlfn.STDEV.P(#REF!,#REF!,#REF!))","v":{"$error":"#REF!"}},{"$f":"#REF!-(3*_xlfn.STDEV.P(#REF!,#REF!,#REF!))","v":{"$error":"#REF!"}},{"$f":"AVERAGE(#REF!)","v":{"$error":"#REF!"}},{"$f":"#REF!","v":{"$error":"#REF!"}},{"$f":"#REF!","v":{"$error":"#REF!"}},{"$f":"#REF!","v":{"$error":"#REF!"}}]
[null,null,null,4,{"$f":"+#REF!","v":{"$error":"#REF!"}},{"$f":"#REF!","v":{"$error":"#REF!"}},{"$f":"#REF!","v":{"$error":"#REF!"}},{"$f":"#REF!","v":{"$error":"#REF!"}},4,{"$f":"#REF!+(3*_xlfn.STDEV.P(#REF!,#REF!,#REF!))","v":{"$error":"#REF!"}},{"$f":"#REF!-(3*_xlfn.STDEV.P(#REF!,#REF!,#REF!))","v":{"$error":"#REF!"}},{"$f":"AVERAGE(#REF!)","v":{"$error":"#REF!"}},{"$f":"#REF!","v":{"$error":"#REF!"}},{"$f":"#REF!","v":{"$error":"#REF!"}},{"$f":"#REF!","v":{"$error":"#REF!"}}]
[null,null,null,5,{"$f":"+#REF!","v":{"$error":"#REF!"}},{"$f":"#REF!","v":{"$error":"#REF!"}},{"$f":"#REF!","v":{"$error":"#REF!"}},{"$f":"#REF!","v":{"$error":"#REF!"}},5,{"$f":"#REF!+(3*_xlfn.STDEV.P(#REF!,#REF!,#REF!))","v":{"$error":"#REF!"}},{"$f":"#REF!-(3*_xlfn.STDEV.P(#REF!,#REF!,#REF!))","v":{"$error":"#REF!"}},{"$f":"AVERAGE(#REF!)","v":{"$error":"#REF!"}},{"$f":"#REF!","v":{"$error":"#REF!"}},{"$f":"#REF!","v":{"$error":"#REF!"}},{"$f":"#REF!","v":{"$error":"#REF!"}}]
[null,null,null,6,{"$f":"+#REF!","v":{"$error":"#REF!"}},{"$f":"#REF!","v":{"$error":"#REF!"}},{"$f":"#REF!","v":{"$error":"#REF!"}},{"$f":"#REF!","v":{"$error":"#REF!"}},6,{"$f":"#REF!+(3*_xlfn.STDEV.P(#REF!,#REF!,#REF!))","v":{"$error":"#REF!"}},{"$f":"#REF!-(3*_xlfn.STDEV.P(#REF!,#REF!,#REF!))","v":{"$error":"#REF!"}},{"$f":"AVERAGE(#REF!)","v":{"$error":"#REF!"}},{"$f":"#REF!","v":{"$error":"#REF!"}},{"$f":"#REF!","v":{"$error":"#REF!"}},{"$f":"#REF!","v":{"$error":"#REF!"}}]
[null,null,null,7,{"$f":"+#REF!","v":{"$error":"#REF!"}},{"$f":"#REF!","v":{"$error":"#REF!"}},{"$f":"#REF!","v":{"$error":"#REF!"}},{"$f":"#REF!","v":{"$error":"#REF!"}},7,{"$f":"#REF!+(3*_xlfn.STDEV.P(#REF!,#REF!,#REF!))","v":{"$error":"#REF!"}},{"$f":"#REF!-(3*_xlfn.STDEV.P(#REF!,#REF!,#REF!))","v":{"$error":"#REF!"}},{"$f":"AVERAGE(#REF!)","v":{"$error":"#REF!"}},{"$f":"#REF!","v":{"$error":"#REF!"}},{"$f":"#REF!","v":{"$error":"#REF!"}},{"$f":"#REF!","v":{"$error":"#REF!"}}]
[null,null,null,8,{"$f":"+#REF!","v":{"$error":"#REF!"}},{"$f":"#REF!","v":{"$error":"#REF!"}},{"$f":"#REF!","v":{"$error":"#REF!"}},{"$f":"#REF!","v":{"$error":"#REF!"}},8,{"$f":"#REF!+(3*_xlfn.STDEV.P(#REF!,#REF!,#REF!))","v":{"$error":"#REF!"}},{"$f":"#REF!-(3*_xlfn.STDEV.P(#REF!,#REF!,#REF!))","v":{"$error":"#REF!"}},{"$f":"AVERAGE(#REF!)","v":{"$error":"#REF!"}},{"$f":"#REF!","v":{"$error":"#REF!"}},{"$f":"#REF!","v":{"$error":"#REF!"}},{"$f":"#REF!","v":{"$error":"#REF!"}}]
[null,null,null,9,{"$f":"+#REF!","v":{"$error":"#REF!"}},{"$f":"#REF!","v":{"$error":"#REF!"}},{"$f":"#REF!","v":{"$error":"#REF!"}},{"$f":"#REF!","v":{"$error":"#REF!"}},9,{"$f":"#REF!+(3*_xlfn.STDEV.P(#REF!,#REF!,#REF!))","v":{"$error":"#REF!"}},{"$f":"#REF!-(3*_xlfn.STDEV.P(#REF!,#REF!,#REF!))","v":{"$error":"#REF!"}},{"$f":"AVERAGE(#REF!)","v":{"$error":"#REF!"}},{"$f":"#REF!","v":{"$error":"#REF!"}},{"$f":"#REF!","v":{"$error":"#REF!"}},{"$f":"#REF!","v":{"$error":"#REF!"}}]
[null,null,null,10,{"$f":"+#REF!","v":{"$error":"#REF!"}},{"$f":"#REF!","v":{"$error":"#REF!"}},{"$f":"#REF!","v":{"$error":"#REF!"}},{"$f":"#REF!","v":{"$error":"#REF!"}},10,{"$f":"#REF!+(3*_xlfn.STDEV.P(#REF!,#REF!,#REF!))","v":{"$error":"#REF!"}},{"$f":"#REF!-(3*_xlfn.STDEV.P(#REF!,#REF!,#REF!))","v":{"$error":"#REF!"}},{"$f":"AVERAGE(#REF!)","v":{"$error":"#REF!"}},{"$f":"#REF!","v":{"$error":"#REF!"}},{"$f":"#REF!","v":{"$error":"#REF!"}},{"$f":"#REF!","v":{"$error":"#REF!"}}]
[]
[]
[null,null,null,null,null,"r","r","r",null,null,null,null,"average","average","average"]
[null,null,null,null,"UCL r",{"$f":"#REF!","v":{"$error":"#REF!"}},{"$f":"#REF!","v":{"$error":"#REF!"}},{"$f":"#REF!","v":{"$error":"#REF!"}},null,"UCL a","LCL a","avarage",{"$f":"#REF!","v":{"$error":"#REF!"}},{"$f":"#REF!","v":{"$error":"#REF!"}},{"$f":"#REF!","v":{"$error":"#REF!"}}]
[null,null,null,1,{"$f":"+#REF!","v":{"$error":"#REF!"}},{"$f":"#REF!","v":{"$error":"#REF!"}},{"$f":"#REF!","v":{"$error":"#REF!"}},{"$f":"#REF!","v":{"$error":"#REF!"}},{"$f":"D343","v":1},{"$f":"#REF!+(3*_xlfn.STDEV.P(#REF!,#REF!,#REF!))","v":{"$error":"#REF!"}},{"$f":"#REF!-(3*_xlfn.STDEV.P(#REF!,#REF!,#REF!))","v":{"$error":"#REF!"}},{"$f":"AVERAGE(#REF!)","v":{"$error":"#REF!"}},{"$f":"#REF!","v":{"$error":"#REF!"}},{"$f":"#REF!","v":{"$error":"#REF!"}},{"$f":"#REF!","v":{"$error":"#REF!"}}]
[null,null,null,2,{"$f":"+#REF!","v":{"$error":"#REF!"}},{"$f":"#REF!","v":{"$error":"#REF!"}},{"$f":"#REF!","v":{"$error":"#REF!"}},{"$f":"#REF!","v":{"$error":"#REF!"}},2,{"$f":"#REF!+(3*_xlfn.STDEV.P(#REF!,#REF!,#REF!))","v":{"$error":"#REF!"}},{"$f":"#REF!-(3*_xlfn.STDEV.P(#REF!,#REF!,#REF!))","v":{"$error":"#REF!"}},{"$f":"AVERAGE(#REF!)","v":{"$error":"#REF!"}},{"$f":"#REF!","v":{"$error":"#REF!"}},{"$f":"#REF!","v":{"$error":"#REF!"}},{"$f":"#REF!","v":{"$error":"#REF!"}}]
[null,null,null,3,{"$f":"+#REF!","v":{"$error":"#REF!"}},{"$f":"#REF!","v":{"$error":"#REF!"}},{"$f":"#REF!","v":{"$error":"#REF!"}},{"$f":"#REF!","v":{"$error":"#REF!"}},3,{"$f":"#REF!+(3*_xlfn.STDEV.P(#REF!,#REF!,#REF!))","v":{"$error":"#REF!"}},{"$f":"#REF!-(3*_xlfn.STDEV.P(#REF!,#REF!,#REF!))","v":{"$error":"#REF!"}},{"$f":"AVERAGE(#REF!)","v":{"$error":"#REF!"}},{"$f":"#REF!","v":{"$error":"#REF!"}},{"$f":"#REF!","v":{"$error":"#REF!"}},{"$f":"#REF!","v":{"$error":"#REF!"}}]
[null,null,null,4,{"$f":"+#REF!","v":{"$error":"#REF!"}},{"$f":"#REF!","v":{"$error":"#REF!"}},{"$f":"#REF!","v":{"$error":"#REF!"}},{"$f":"#REF!","v":{"$error":"#REF!"}},4,{"$f":"#REF!+(3*_xlfn.STDEV.P(#REF!,#REF!,#REF!))","v":{"$error":"#REF!"}},{"$f":"#REF!-(3*_xlfn.STDEV.P(#REF!,#REF!,#REF!))","v":{"$error":"#REF!"}},{"$f":"AVERAGE(#REF!)","v":{"$error":"#REF!"}},{"$f":"#REF!","v":{"$error":"#REF!"}},{"$f":"#REF!","v":{"$error":"#REF!"}},{"$f":"#REF!","v":{"$error":"#REF!"}}]
[null,null,null,5,{"$f":"+#REF!","v":{"$error":"#REF!"}},{"$f":"#REF!","v":{"$error":"#REF!"}},{"$f":"#REF!","v":{"$error":"#REF!"}},{"$f":"#REF!","v":{"$error":"#REF!"}},5,{"$f":"#REF!+(3*_xlfn.STDEV.P(#REF!,#REF!,#REF!))","v":{"$error":"#REF!"}},{"$f":"#REF!-(3*_xlfn.STDEV.P(#REF!,#REF!,#REF!))","v":{"$error":"#REF!"}},{"$f":"AVERAGE(#REF!)","v":{"$error":"#REF!"}},{"$f":"#REF!","v":{"$error":"#REF!"}},{"$f":"#REF!","v":{"$error":"#REF!"}},{"$f":"#REF!","v":{"$error":"#REF!"}}]
[null,null,null,6,{"$f":"+#REF!","v":{"$error":"#REF!"}},{"$f":"#REF!","v":{"$error":"#REF!"}},{"$f":"#REF!","v":{"$error":"#REF!"}},{"$f":"#REF!","v":{"$error":"#REF!"}},6,{"$f":"#REF!+(3*_xlfn.STDEV.P(#REF!,#REF!,#REF!))","v":{"$error":"#REF!"}},{"$f":"#REF!-(3*_xlfn.STDEV.P(#REF!,#REF!,#REF!))","v":{"$error":"#REF!"}},{"$f":"AVERAGE(#REF!)","v":{"$error":"#REF!"}},{"$f":"#REF!","v":{"$error":"#REF!"}},{"$f":"#REF!","v":{"$error":"#REF!"}},{"$f":"#REF!","v":{"$error":"#REF!"}}]
[null,null,null,7,{"$f":"+#REF!","v":{"$error":"#REF!"}},{"$f":"#REF!","v":{"$error":"#REF!"}},{"$f":"#REF!","v":{"$error":"#REF!"}},{"$f":"#REF!","v":{"$error":"#REF!"}},7,{"$f":"#REF!+(3*_xlfn.STDEV.P(#REF!,#REF!,#REF!))","v":{"$error":"#REF!"}},{"$f":"#REF!-(3*_xlfn.STDEV.P(#REF!,#REF!,#REF!))","v":{"$error":"#REF!"}},{"$f":"AVERAGE(#REF!)","v":{"$error":"#REF!"}},{"$f":"#REF!","v":{"$error":"#REF!"}},{"$f":"#REF!","v":{"$error":"#REF!"}},{"$f":"#REF!","v":{"$error":"#REF!"}}]
[null,null,null,8,{"$f":"+#REF!","v":{"$error":"#REF!"}},{"$f":"#REF!","v":{"$error":"#REF!"}},{"$f":"#REF!","v":{"$error":"#REF!"}},{"$f":"#REF!","v":{"$error":"#REF!"}},8,{"$f":"#REF!+(3*_xlfn.STDEV.P(#REF!,#REF!,#REF!))","v":{"$error":"#REF!"}},{"$f":"#REF!-(3*_xlfn.STDEV.P(#REF!,#REF!,#REF!))","v":{"$error":"#REF!"}},{"$f":"AVERAGE(#REF!)","v":{"$error":"#REF!"}},{"$f":"#REF!","v":{"$error":"#REF!"}},{"$f":"#REF!","v":{"$error":"#REF!"}},{"$f":"#REF!","v":{"$error":"#REF!"}}]
[null,null,null,9,{"$f":"+#REF!","v":{"$error":"#REF!"}},{"$f":"#REF!","v":{"$error":"#REF!"}},{"$f":"#REF!","v":{"$error":"#REF!"}},{"$f":"#REF!","v":{"$error":"#REF!"}},9,{"$f":"#REF!+(3*_xlfn.STDEV.P(#REF!,#REF!,#REF!))","v":{"$error":"#REF!"}},{"$f":"#REF!-(3*_xlfn.STDEV.P(#REF!,#REF!,#REF!))","v":{"$error":"#REF!"}},{"$f":"AVERAGE(#REF!)","v":{"$error":"#REF!"}},{"$f":"#REF!","v":{"$error":"#REF!"}},{"$f":"#REF!","v":{"$error":"#REF!"}},{"$f":"#REF!","v":{"$error":"#REF!"}}]
[null,null,null,10,{"$f":"+#REF!","v":{"$error":"#REF!"}},{"$f":"#REF!","v":{"$error":"#REF!"}},{"$f":"#REF!","v":{"$error":"#REF!"}},{"$f":"#REF!","v":{"$error":"#REF!"}},10,{"$f":"#REF!+(3*_xlfn.STDEV.P(#REF!,#REF!,#REF!))","v":{"$error":"#REF!"}},{"$f":"#REF!-(3*_xlfn.STDEV.P(#REF!,#REF!,#REF!))","v":{"$error":"#REF!"}},{"$f":"AVERAGE(#REF!)","v":{"$error":"#REF!"}},{"$f":"#REF!","v":{"$error":"#REF!"}},{"$f":"#REF!","v":{"$error":"#REF!"}},{"$f":"#REF!","v":{"$error":"#REF!"}}]
[]
[]
[null,null,null,null,null,"r","r","r",null,null,null,null,"average","average","average"]
[null,null,null,null,"UCL r",{"$f":"#REF!","v":{"$error":"#REF!"}},{"$f":"#REF!","v":{"$error":"#REF!"}},{"$f":"#REF!","v":{"$error":"#REF!"}},null,"UCL a","LCL a","avarage",{"$f":"#REF!","v":{"$error":"#REF!"}},{"$f":"#REF!","v":{"$error":"#REF!"}},{"$f":"#REF!","v":{"$error":"#REF!"}}]
[null,null,null,1,{"$f":"+#REF!","v":{"$error":"#REF!"}},{"$f":"#REF!","v":{"$error":"#REF!"}},{"$f":"#REF!","v":{"$error":"#REF!"}},{"$f":"#REF!","v":{"$error":"#REF!"}},{"$f":"D357","v":1},{"$f":"#REF!+(3*_xlfn.STDEV.P(#REF!,#REF!,#REF!))","v":{"$error":"#REF!"}},{"$f":"#REF!-(3*_xlfn.STDEV.P(#REF!,#REF!,#REF!))","v":{"$error":"#REF!"}},{"$f":"AVERAGE(#REF!)","v":{"$error":"#REF!"}},{"$f":"#REF!","v":{"$error":"#REF!"}},{"$f":"#REF!","v":{"$error":"#REF!"}},{"$f":"#REF!","v":{"$error":"#REF!"}}]
[null,null,null,2,{"$f":"+#REF!","v":{"$error":"#REF!"}},{"$f":"#REF!","v":{"$error":"#REF!"}},{"$f":"#REF!","v":{"$error":"#REF!"}},{"$f":"#REF!","v":{"$error":"#REF!"}},2,{"$f":"#REF!+(3*_xlfn.STDEV.P(#REF!,#REF!,#REF!))","v":{"$error":"#REF!"}},{"$f":"#REF!-(3*_xlfn.STDEV.P(#REF!,#REF!,#REF!))","v":{"$error":"#REF!"}},{"$f":"AVERAGE(#REF!)","v":{"$error":"#REF!"}},{"$f":"#REF!","v":{"$error":"#REF!"}},{"$f":"#REF!","v":{"$error":"#REF!"}},{"$f":"#REF!","v":{"$error":"#REF!"}}]
[null,null,null,3,{"$f":"+#REF!","v":{"$error":"#REF!"}},{"$f":"#REF!","v":{"$error":"#REF!"}},{"$f":"#REF!","v":{"$error":"#REF!"}},{"$f":"#REF!","v":{"$error":"#REF!"}},3,{"$f":"#REF!+(3*_xlfn.STDEV.P(#REF!,#REF!,#REF!))","v":{"$error":"#REF!"}},{"$f":"#REF!-(3*_xlfn.STDEV.P(#REF!,#REF!,#REF!))","v":{"$error":"#REF!"}},{"$f":"AVERAGE(#REF!)","v":{"$error":"#REF!"}},{"$f":"#REF!","v":{"$error":"#REF!"}},{"$f":"#REF!","v":{"$error":"#REF!"}},{"$f":"#REF!","v":{"$error":"#REF!"}}]
[null,null,null,4,{"$f":"+#REF!","v":{"$error":"#REF!"}},{"$f":"#REF!","v":{"$error":"#REF!"}},{"$f":"#REF!","v":{"$error":"#REF!"}},{"$f":"#REF!","v":{"$error":"#REF!"}},4,{"$f":"#REF!+(3*_xlfn.STDEV.P(#REF!,#REF!,#REF!))","v":{"$error":"#REF!"}},{"$f":"#REF!-(3*_xlfn.STDEV.P(#REF!,#REF!,#REF!))","v":{"$error":"#REF!"}},{"$f":"AVERAGE(#REF!)","v":{"$error":"#REF!"}},{"$f":"#REF!","v":{"$error":"#REF!"}},{"$f":"#REF!","v":{"$error":"#REF!"}},{"$f":"#REF!","v":{"$error":"#REF!"}}]
[null,null,null,5,{"$f":"+#REF!","v":{"$error":"#REF!"}},{"$f":"#REF!","v":{"$error":"#REF!"}},{"$f":"#REF!","v":{"$error":"#REF!"}},{"$f":"#REF!","v":{"$error":"#REF!"}},5,{"$f":"#REF!+(3*_xlfn.STDEV.P(#REF!,#REF!,#REF!))","v":{"$error":"#REF!"}},{"$f":"#REF!-(3*_xlfn.STDEV.P(#REF!,#REF!,#REF!))","v":{"$error":"#REF!"}},{"$f":"AVERAGE(#REF!)","v":{"$error":"#REF!"}},{"$f":"#REF!","v":{"$error":"#REF!"}},{"$f":"#REF!","v":{"$error":"#REF!"}},{"$f":"#REF!","v":{"$error":"#REF!"}}]
[null,null,null,6,{"$f":"+#REF!","v":{"$error":"#REF!"}},{"$f":"#REF!","v":{"$error":"#REF!"}},{"$f":"#REF!","v":{"$error":"#REF!"}},{"$f":"#REF!","v":{"$error":"#REF!"}},6,{"$f":"#REF!+(3*_xlfn.STDEV.P(#REF!,#REF!,#REF!))","v":{"$error":"#REF!"}},{"$f":"#REF!-(3*_xlfn.STDEV.P(#REF!,#REF!,#REF!))","v":{"$error":"#REF!"}},{"$f":"AVERAGE(#REF!)","v":{"$error":"#REF!"}},{"$f":"#REF!","v":{"$error":"#REF!"}},{"$f":"#REF!","v":{"$error":"#REF!"}},{"$f":"#REF!","v":{"$error":"#REF!"}}]
[null,null,null,7,{"$f":"+#REF!","v":{"$error":"#REF!"}},{"$f":"#REF!","v":{"$error":"#REF!"}},{"$f":"#REF!","v":{"$error":"#REF!"}},{"$f":"#REF!","v":{"$error":"#REF!"}},7,{"$f":"#REF!+(3*_xlfn.STDEV.P(#REF!,#REF!,#REF!))","v":{"$error":"#REF!"}},{"$f":"#REF!-(3*_xlfn.STDEV.P(#REF!,#REF!,#REF!))","v":{"$error":"#REF!"}},{"$f":"AVERAGE(#REF!)","v":{"$error":"#REF!"}},{"$f":"#REF!","v":{"$error":"#REF!"}},{"$f":"#REF!","v":{"$error":"#REF!"}},{"$f":"#REF!","v":{"$error":"#REF!"}}]
[null,null,null,8,{"$f":"+#REF!","v":{"$error":"#REF!"}},{"$f":"#REF!","v":{"$error":"#REF!"}},{"$f":"#REF!","v":{"$error":"#REF!"}},{"$f":"#REF!","v":{"$error":"#REF!"}},8,{"$f":"#REF!+(3*_xlfn.STDEV.P(#REF!,#REF!,#REF!))","v":{"$error":"#REF!"}},{"$f":"#REF!-(3*_xlfn.STDEV.P(#REF!,#REF!,#REF!))","v":{"$error":"#REF!"}},{"$f":"AVERAGE(#REF!)","v":{"$error":"#REF!"}},{"$f":"#REF!","v":{"$error":"#REF!"}},{"$f":"#REF!","v":{"$error":"#REF!"}},{"$f":"#REF!","v":{"$error":"#REF!"}}]
[null,null,null,9,{"$f":"+#REF!","v":{"$error":"#REF!"}},{"$f":"#REF!","v":{"$error":"#REF!"}},{"$f":"#REF!","v":{"$error":"#REF!"}},{"$f":"#REF!","v":{"$error":"#REF!"}},9,{"$f":"#REF!+(3*_xlfn.STDEV.P(#REF!,#REF!,#REF!))","v":{"$error":"#REF!"}},{"$f":"#REF!-(3*_xlfn.STDEV.P(#REF!,#REF!,#REF!))","v":{"$error":"#REF!"}},{"$f":"AVERAGE(#REF!)","v":{"$error":"#REF!"}},{"$f":"#REF!","v":{"$error":"#REF!"}},{"$f":"#REF!","v":{"$error":"#REF!"}},{"$f":"#REF!","v":{"$error":"#REF!"}}]
[null,null,null,10,{"$f":"+#REF!","v":{"$error":"#REF!"}},{"$f":"#REF!","v":{"$error":"#REF!"}},{"$f":"#REF!","v":{"$error":"#REF!"}},{"$f":"#REF!","v":{"$error":"#REF!"}},10,{"$f":"#REF!+(3*_xlfn.STDEV.P(#REF!,#REF!,#REF!))","v":{"$error":"#REF!"}},{"$f":"#REF!-(3*_xlfn.STDEV.P(#REF!,#REF!,#REF!))","v":{"$error":"#REF!"}},{"$f":"AVERAGE(#REF!)","v":{"$error":"#REF!"}},{"$f":"#REF!","v":{"$error":"#REF!"}},{"$f":"#REF!","v":{"$error":"#REF!"}},{"$f":"#REF!","v":{"$error":"#REF!"}}]
[]
[]
[null,null,null,null,null,"r","r","r",null,null,null,null,"average","average","average"]
[null,null,null,null,"UCL r",{"$f":"#REF!","v":{"$error":"#REF!"}},{"$f":"#REF!","v":{"$error":"#REF!"}},{"$f":"#REF!","v":{"$error":"#REF!"}},null,"UCL a","LCL a","avarage",{"$f":"#REF!","v":{"$error":"#REF!"}},{"$f":"#REF!","v":{"$error":"#REF!"}},{"$f":"#REF!","v":{"$error":"#REF!"}}]
[null,null,null,1,{"$f":"+#REF!","v":{"$error":"#REF!"}},{"$f":"#REF!","v":{"$error":"#REF!"}},{"$f":"#REF!","v":{"$error":"#REF!"}},{"$f":"#REF!","v":{"$error":"#REF!"}},{"$f":"D371","v":1},{"$f":"#REF!+(3*_xlfn.STDEV.P(#REF!,#REF!,#REF!))","v":{"$error":"#REF!"}},{"$f":"#REF!-(3*_xlfn.STDEV.P(#REF!,#REF!,#REF!))","v":{"$error":"#REF!"}},{"$f":"AVERAGE(#REF!)","v":{"$error":"#REF!"}},{"$f":"#REF!","v":{"$error":"#REF!"}},{"$f":"#REF!","v":{"$error":"#REF!"}},{"$f":"#REF!","v":{"$error":"#REF!"}}]
[null,null,null,2,{"$f":"+#REF!","v":{"$error":"#REF!"}},{"$f":"#REF!","v":{"$error":"#REF!"}},{"$f":"#REF!","v":{"$error":"#REF!"}},{"$f":"#REF!","v":{"$error":"#REF!"}},2,{"$f":"#REF!+(3*_xlfn.STDEV.P(#REF!,#REF!,#REF!))","v":{"$error":"#REF!"}},{"$f":"#REF!-(3*_xlfn.STDEV.P(#REF!,#REF!,#REF!))","v":{"$error":"#REF!"}},{"$f":"AVERAGE(#REF!)","v":{"$error":"#REF!"}},{"$f":"#REF!","v":{"$error":"#REF!"}},{"$f":"#REF!","v":{"$error":"#REF!"}},{"$f":"#REF!","v":{"$error":"#REF!"}}]
[null,null,null,3,{"$f":"+#REF!","v":{"$error":"#REF!"}},{"$f":"#REF!","v":{"$error":"#REF!"}},{"$f":"#REF!","v":{"$error":"#REF!"}},{"$f":"#REF!","v":{"$error":"#REF!"}},3,{"$f":"#REF!+(3*_xlfn.STDEV.P(#REF!,#REF!,#REF!))","v":{"$error":"#REF!"}},{"$f":"#REF!-(3*_xlfn.STDEV.P(#REF!,#REF!,#REF!))","v":{"$error":"#REF!"}},{"$f":"AVERAGE(#REF!)","v":{"$error":"#REF!"}},{"$f":"#REF!","v":{"$error":"#REF!"}},{"$f":"#REF!","v":{"$error":"#REF!"}},{"$f":"#REF!","v":{"$error":"#REF!"}}]
[null,null,null,4,{"$f":"+#REF!","v":{"$error":"#REF!"}},{"$f":"#REF!","v":{"$error":"#REF!"}},{"$f":"#REF!","v":{"$error":"#REF!"}},{"$f":"#REF!","v":{"$error":"#REF!"}},4,{"$f":"#REF!+(3*_xlfn.STDEV.P(#REF!,#REF!,#REF!))","v":{"$error":"#REF!"}},{"$f":"#REF!-(3*_xlfn.STDEV.P(#REF!,#REF!,#REF!))","v":{"$error":"#REF!"}},{"$f":"AVERAGE(#REF!)","v":{"$error":"#REF!"}},{"$f":"#REF!","v":{"$error":"#REF!"}},{"$f":"#REF!","v":{"$error":"#REF!"}},{"$f":"#REF!","v":{"$error":"#REF!"}}]
[null,null,null,5,{"$f":"+#REF!","v":{"$error":"#REF!"}},{"$f":"#REF!","v":{"$error":"#REF!"}},{"$f":"#REF!","v":{"$error":"#REF!"}},{"$f":"#REF!","v":{"$error":"#REF!"}},5,{"$f":"#REF!+(3*_xlfn.STDEV.P(#REF!,#REF!,#REF!))","v":{"$error":"#REF!"}},{"$f":"#REF!-(3*_xlfn.STDEV.P(#REF!,#REF!,#REF!))","v":{"$error":"#REF!"}},{"$f":"AVERAGE(#REF!)","v":{"$error":"#REF!"}},{"$f":"#REF!","v":{"$error":"#REF!"}},{"$f":"#REF!","v":{"$error":"#REF!"}},{"$f":"#REF!","v":{"$error":"#REF!"}}]
[null,null,null,6,{"$f":"+#REF!","v":{"$error":"#REF!"}},{"$f":"#REF!","v":{"$error":"#REF!"}},{"$f":"#REF!","v":{"$error":"#REF!"}},{"$f":"#REF!","v":{"$error":"#REF!"}},6,{"$f":"#REF!+(3*_xlfn.STDEV.P(#REF!,#REF!,#REF!))","v":{"$error":"#REF!"}},{"$f":"#REF!-(3*_xlfn.STDEV.P(#REF!,#REF!,#REF!))","v":{"$error":"#REF!"}},{"$f":"AVERAGE(#REF!)","v":{"$error":"#REF!"}},{"$f":"#REF!","v":{"$error":"#REF!"}},{"$f":"#REF!","v":{"$error":"#REF!"}},{"$f":"#REF!","v":{"$error":"#REF!"}}]
[null,null,null,7,{"$f":"+#REF!","v":{"$error":"#REF!"}},{"$f":"#REF!","v":{"$error":"#REF!"}},{"$f":"#REF!","v":{"$error":"#REF!"}},{"$f":"#REF!","v":{"$error":"#REF!"}},7,{"$f":"#REF!+(3*_xlfn.STDEV.P(#REF!,#REF!,#REF!))","v":{"$error":"#REF!"}},{"$f":"#REF!-(3*_xlfn.STDEV.P(#REF!,#REF!,#REF!))","v":{"$error":"#REF!"}},{"$f":"AVERAGE(#REF!)","v":{"$error":"#REF!"}},{"$f":"#REF!","v":{"$error":"#REF!"}},{"$f":"#REF!","v":{"$error":"#REF!"}},{"$f":"#REF!","v":{"$error":"#REF!"}}]
[null,null,null,8,{"$f":"+#REF!","v":{"$error":"#REF!"}},{"$f":"#REF!","v":{"$error":"#REF!"}},{"$f":"#REF!","v":{"$error":"#REF!"}},{"$f":"#REF!","v":{"$error":"#REF!"}},8,{"$f":"#REF!+(3*_xlfn.STDEV.P(#REF!,#REF!,#REF!))","v":{"$error":"#REF!"}},{"$f":"#REF!-(3*_xlfn.STDEV.P(#REF!,#REF!,#REF!))","v":{"$error":"#REF!"}},{"$f":"AVERAGE(#REF!)","v":{"$error":"#REF!"}},{"$f":"#REF!","v":{"$error":"#REF!"}},{"$f":"#REF!","v":{"$error":"#REF!"}},{"$f":"#REF!","v":{"$error":"#REF!"}}]
[null,null,null,9,{"$f":"+#REF!","v":{"$error":"#REF!"}},{"$f":"#REF!","v":{"$error":"#REF!"}},{"$f":"#REF!","v":{"$error":"#REF!"}},{"$f":"#REF!","v":{"$error":"#REF!"}},9,{"$f":"#REF!+(3*_xlfn.STDEV.P(#REF!,#REF!,#REF!))","v":{"$error":"#REF!"}},{"$f":"#REF!-(3*_xlfn.STDEV.P(#REF!,#REF!,#REF!))","v":{"$error":"#REF!"}},{"$f":"AVERAGE(#REF!)","v":{"$error":"#REF!"}},{"$f":"#REF!","v":{"$error":"#REF!"}},{"$f":"#REF!","v":{"$error":"#REF!"}},{"$f":"#REF!","v":{"$error":"#REF!"}}]
[null,null,null,10,{"$f":"+#REF!","v":{"$error":"#REF!"}},{"$f":"#REF!","v":{"$error":"#REF!"}},{"$f":"#REF!","v":{"$error":"#REF!"}},{"$f":"#REF!","v":{"$error":"#REF!"}},10,{"$f":"#REF!+(3*_xlfn.STDEV.P(#REF!,#REF!,#REF!))","v":{"$error":"#REF!"}},{"$f":"#REF!-(3*_xlfn.STDEV.P(#REF!,#REF!,#REF!))","v":{"$error":"#REF!"}},{"$f":"AVERAGE(#REF!)","v":{"$error":"#REF!"}},{"$f":"#REF!","v":{"$error":"#REF!"}},{"$f":"#REF!","v":{"$error":"#REF!"}},{"$f":"#REF!","v":{"$error":"#REF!"}}]
[]
[]
[null,null,null,null,null,"r","r","r",null,null,null,null,"average","average","average"]
[null,null,null,null,"UCL r",{"$f":"#REF!","v":{"$error":"#REF!"}},{"$f":"#REF!","v":{"$error":"#REF!"}},{"$f":"#REF!","v":{"$error":"#REF!"}},null,"UCL a","LCL a","avarage",{"$f":"#REF!","v":{"$error":"#REF!"}},{"$f":"#REF!","v":{"$error":"#REF!"}},{"$f":"#REF!","v":{"$error":"#REF!"}}]
[null,null,null,1,{"$f":"+#REF!","v":{"$error":"#REF!"}},{"$f":"#REF!","v":{"$error":"#REF!"}},{"$f":"#REF!","v":{"$error":"#REF!"}},{"$f":"#REF!","v":{"$error":"#REF!"}},{"$f":"D385","v":1},{"$f":"#REF!+(3*_xlfn.STDEV.P(#REF!,#REF!,#REF!))","v":{"$error":"#REF!"}},{"$f":"#REF!-(3*_xlfn.STDEV.P(#REF!,#REF!,#REF!))","v":{"$error":"#REF!"}},{"$f":"AVERAGE(#REF!)","v":{"$error":"#REF!"}},{"$f":"#REF!","v":{"$error":"#REF!"}},{"$f":"#REF!","v":{"$error":"#REF!"}},{"$f":"#REF!","v":{"$error":"#REF!"}}]
[null,null,null,2,{"$f":"+#REF!","v":{"$error":"#REF!"}},{"$f":"#REF!","v":{"$error":"#REF!"}},{"$f":"#REF!","v":{"$error":"#REF!"}},{"$f":"#REF!","v":{"$error":"#REF!"}},2,{"$f":"#REF!+(3*_xlfn.STDEV.P(#REF!,#REF!,#REF!))","v":{"$error":"#REF!"}},{"$f":"#REF!-(3*_xlfn.STDEV.P(#REF!,#REF!,#REF!))","v":{"$error":"#REF!"}},{"$f":"AVERAGE(#REF!)","v":{"$error":"#REF!"}},{"$f":"#REF!","v":{"$error":"#REF!"}},{"$f":"#REF!","v":{"$error":"#REF!"}},{"$f":"#REF!","v":{"$error":"#REF!"}}]
[null,null,null,3,{"$f":"+#REF!","v":{"$error":"#REF!"}},{"$f":"#REF!","v":{"$error":"#REF!"}},{"$f":"#REF!","v":{"$error":"#REF!"}},{"$f":"#REF!","v":{"$error":"#REF!"}},3,{"$f":"#REF!+(3*_xlfn.STDEV.P(#REF!,#REF!,#REF!))","v":{"$error":"#REF!"}},{"$f":"#REF!-(3*_xlfn.STDEV.P(#REF!,#REF!,#REF!))","v":{"$error":"#REF!"}},{"$f":"AVERAGE(#REF!)","v":{"$error":"#REF!"}},{"$f":"#REF!","v":{"$error":"#REF!"}},{"$f":"#REF!","v":{"$error":"#REF!"}},{"$f":"#REF!","v":{"$error":"#REF!"}}]
[null,null,null,4,{"$f":"+#REF!","v":{"$error":"#REF!"}},{"$f":"#REF!","v":{"$error":"#REF!"}},{"$f":"#REF!","v":{"$error":"#REF!"}},{"$f":"#REF!","v":{"$error":"#REF!"}},4,{"$f":"#REF!+(3*_xlfn.STDEV.P(#REF!,#REF!,#REF!))","v":{"$error":"#REF!"}},{"$f":"#REF!-(3*_xlfn.STDEV.P(#REF!,#REF!,#REF!))","v":{"$error":"#REF!"}},{"$f":"AVERAGE(#REF!)","v":{"$error":"#REF!"}},{"$f":"#REF!","v":{"$error":"#REF!"}},{"$f":"#REF!","v":{"$error":"#REF!"}},{"$f":"#REF!","v":{"$error":"#REF!"}}]
[null,null,null,5,{"$f":"+#REF!","v":{"$error":"#REF!"}},{"$f":"#REF!","v":{"$error":"#REF!"}},{"$f":"#REF!","v":{"$error":"#REF!"}},{"$f":"#REF!","v":{"$error":"#REF!"}},5,{"$f":"#REF!+(3*_xlfn.STDEV.P(#REF!,#REF!,#REF!))","v":{"$error":"#REF!"}},{"$f":"#REF!-(3*_xlfn.STDEV.P(#REF!,#REF!,#REF!))","v":{"$error":"#REF!"}},{"$f":"AVERAGE(#REF!)","v":{"$error":"#REF!"}},{"$f":"#REF!","v":{"$error":"#REF!"}},{"$f":"#REF!","v":{"$error":"#REF!"}},{"$f":"#REF!","v":{"$error":"#REF!"}}]
[null,null,null,6,{"$f":"+#REF!","v":{"$error":"#REF!"}},{"$f":"#REF!","v":{"$error":"#REF!"}},{"$f":"#REF!","v":{"$error":"#REF!"}},{"$f":"#REF!","v":{"$error":"#REF!"}},6,{"$f":"#REF!+(3*_xlfn.STDEV.P(#REF!,#REF!,#REF!))","v":{"$error":"#REF!"}},{"$f":"#REF!-(3*_xlfn.STDEV.P(#REF!,#REF!,#REF!))","v":{"$error":"#REF!"}},{"$f":"AVERAGE(#REF!)","v":{"$error":"#REF!"}},{"$f":"#REF!","v":{"$error":"#REF!"}},{"$f":"#REF!","v":{"$error":"#REF!"}},{"$f":"#REF!","v":{"$error":"#REF!"}}]
[null,null,null,7,{"$f":"+#REF!","v":{"$error":"#REF!"}},{"$f":"#REF!","v":{"$error":"#REF!"}},{"$f":"#REF!","v":{"$error":"#REF!"}},{"$f":"#REF!","v":{"$error":"#REF!"}},7,{"$f":"#REF!+(3*_xlfn.STDEV.P(#REF!,#REF!,#REF!))","v":{"$error":"#REF!"}},{"$f":"#REF!-(3*_xlfn.STDEV.P(#REF!,#REF!,#REF!))","v":{"$error":"#REF!"}},{"$f":"AVERAGE(#REF!)","v":{"$error":"#REF!"}},{"$f":"#REF!","v":{"$error":"#REF!"}},{"$f":"#REF!","v":{"$error":"#REF!"}},{"$f":"#REF!","v":{"$error":"#REF!"}}]
[null,null,null,8,{"$f":"+#REF!","v":{"$error":"#REF!"}},{"$f":"#REF!","v":{"$error":"#REF!"}},{"$f":"#REF!","v":{"$error":"#REF!"}},{"$f":"#REF!","v":{"$error":"#REF!"}},8,{"$f":"#REF!+(3*_xlfn.STDEV.P(#REF!,#REF!,#REF!))","v":{"$error":"#REF!"}},{"$f":"#REF!-(3*_xlfn.STDEV.P(#REF!,#REF!,#REF!))","v":{"$error":"#REF!"}},{"$f":"AVERAGE(#REF!)","v":{"$error":"#REF!"}},{"$f":"#REF!","v":{"$error":"#REF!"}},{"$f":"#REF!","v":{"$error":"#REF!"}},{"$f":"#REF!","v":{"$error":"#REF!"}}]
[null,null,null,9,{"$f":"+#REF!","v":{"$error":"#REF!"}},{"$f":"#REF!","v":{"$error":"#REF!"}},{"$f":"#REF!","v":{"$error":"#REF!"}},{"$f":"#REF!","v":{"$error":"#REF!"}},9,{"$f":"#REF!+(3*_xlfn.STDEV.P(#REF!,#REF!,#REF!))","v":{"$error":"#REF!"}},{"$f":"#REF!-(3*_xlfn.STDEV.P(#REF!,#REF!,#REF!))","v":{"$error":"#REF!"}},{"$f":"AVERAGE(#REF!)","v":{"$error":"#REF!"}},{"$f":"#REF!","v":{"$error":"#REF!"}},{"$f":"#REF!","v":{"$error":"#REF!"}},{"$f":"#REF!","v":{"$error":"#REF!"}}]
[null,null,null,10,{"$f":"+#REF!","v":{"$error":"#REF!"}},{"$f":"#REF!","v":{"$error":"#REF!"}},{"$f":"#REF!","v":{"$error":"#REF!"}},{"$f":"#REF!","v":{"$error":"#REF!"}},10,{"$f":"#REF!+(3*_xlfn.STDEV.P(#REF!,#REF!,#REF!))","v":{"$error":"#REF!"}},{"$f":"#REF!-(3*_xlfn.STDEV.P(#REF!,#REF!,#REF!))","v":{"$error":"#REF!"}},{"$f":"AVERAGE(#REF!)","v":{"$error":"#REF!"}},{"$f":"#REF!","v":{"$error":"#REF!"}},{"$f":"#REF!","v":{"$error":"#REF!"}},{"$f":"#REF!","v":{"$error":"#REF!"}}]
[]
[null,"MSA ANOVA",null,null,"UCL a","LCL a","avarage",{"$f":"#REF!","v":{"$error":"#REF!"}},{"$f":"#REF!","v":{"$error":"#REF!"}},{"$f":"#REF!","v":{"$error":"#REF!"}},null,"UCL r"]
[null,null,null,1,{"$f":"#REF!+(3*_xlfn.STDEV.P(#REF!,#REF!,#REF!))","v":{"$error":"#REF!"}},{"$f":"#REF!-(3*_xlfn.STDEV.P(#REF!,#REF!,#REF!))","v":{"$error":"#REF!"}},{"$f":"AVERAGE(#REF!)","v":{"$error":"#REF!"}},{"$f":"#REF!","v":{"$error":"#REF!"}},{"$f":"#REF!","v":{"$error":"#REF!"}},{"$f":"#REF!","v":{"$error":"#REF!"}},null,{"$f":"+#REF!","v":{"$error":"#REF!"}}]
[null,null,null,2,{"$f":"#REF!+(3*_xlfn.STDEV.P(#REF!,#REF!,#REF!))","v":{"$error":"#REF!"}},{"$f":"#REF!-(3*_xlfn.STDEV.P(#REF!,#REF!,#REF!))","v":{"$error":"#REF!"}},{"$f":"AVERAGE(#REF!)","v":{"$error":"#REF!"}},{"$f":"#REF!","v":{"$error":"#REF!"}},{"$f":"#REF!","v":{"$error":"#REF!"}},{"$f":"#REF!","v":{"$error":"#REF!"}},null,{"$f":"+#REF!","v":{"$error":"#REF!"}}]
[null,null,null,3,{"$f":"#REF!+(3*_xlfn.STDEV.P(#REF!,#REF!,#REF!))","v":{"$error":"#REF!"}},{"$f":"#REF!-(3*_xlfn.STDEV.P(#REF!,#REF!,#REF!))","v":{"$error":"#REF!"}},{"$f":"AVERAGE(#REF!)","v":{"$error":"#REF!"}},{"$f":"#REF!","v":{"$error":"#REF!"}},{"$f":"#REF!","v":{"$error":"#REF!"}},{"$f":"#REF!","v":{"$error":"#REF!"}},null,{"$f":"+#REF!","v":{"$error":"#REF!"}}]
[null,null,null,4,{"$f":"#REF!+(3*_xlfn.STDEV.P(#REF!,#REF!,#REF!))","v":{"$error":"#REF!"}},{"$f":"#REF!-(3*_xlfn.STDEV.P(#REF!,#REF!,#REF!))","v":{"$error":"#REF!"}},{"$f":"AVERAGE(#REF!)","v":{"$error":"#REF!"}},{"$f":"#REF!","v":{"$error":"#REF!"}},{"$f":"#REF!","v":{"$error":"#REF!"}},{"$f":"#REF!","v":{"$error":"#REF!"}},null,{"$f":"+#REF!","v":{"$error":"#REF!"}}]
[null,null,null,5,{"$f":"#REF!+(3*_xlfn.STDEV.P(#REF!,#REF!,#REF!))","v":{"$error":"#REF!"}},{"$f":"#REF!-(3*_xlfn.STDEV.P(#REF!,#REF!,#REF!))","v":{"$error":"#REF!"}},{"$f":"AVERAGE(#REF!)","v":{"$error":"#REF!"}},{"$f":"#REF!","v":{"$error":"#REF!"}},{"$f":"#REF!","v":{"$error":"#REF!"}},{"$f":"#REF!","v":{"$error":"#REF!"}},null,{"$f":"+#REF!","v":{"$error":"#REF!"}}]
[null,null,null,6,{"$f":"#REF!+(3*_xlfn.STDEV.P(#REF!,#REF!,#REF!))","v":{"$error":"#REF!"}},{"$f":"#REF!-(3*_xlfn.STDEV.P(#REF!,#REF!,#REF!))","v":{"$error":"#REF!"}},{"$f":"AVERAGE(#REF!)","v":{"$error":"#REF!"}},{"$f":"#REF!","v":{"$error":"#REF!"}},{"$f":"#REF!","v":{"$error":"#REF!"}},{"$f":"#REF!","v":{"$error":"#REF!"}},null,{"$f":"+#REF!","v":{"$error":"#REF!"}}]
[null,null,null,7,{"$f":"#REF!+(3*_xlfn.STDEV.P(#REF!,#REF!,#REF!))","v":{"$error":"#REF!"}},{"$f":"#REF!-(3*_xlfn.STDEV.P(#REF!,#REF!,#REF!))","v":{"$error":"#REF!"}},{"$f":"AVERAGE(#REF!)","v":{"$error":"#REF!"}},{"$f":"#REF!","v":{"$error":"#REF!"}},{"$f":"#REF!","v":{"$error":"#REF!"}},{"$f":"#REF!","v":{"$error":"#REF!"}},null,{"$f":"+#REF!","v":{"$error":"#REF!"}}]
[null,null,null,8,{"$f":"#REF!+(3*_xlfn.STDEV.P(#REF!,#REF!,#REF!))","v":{"$error":"#REF!"}},{"$f":"#REF!-(3*_xlfn.STDEV.P(#REF!,#REF!,#REF!))","v":{"$error":"#REF!"}},{"$f":"AVERAGE(#REF!)","v":{"$error":"#REF!"}},{"$f":"#REF!","v":{"$error":"#REF!"}},{"$f":"#REF!","v":{"$error":"#REF!"}},{"$f":"#REF!","v":{"$error":"#REF!"}},null,{"$f":"+#REF!","v":{"$error":"#REF!"}}]
[null,null,null,9,{"$f":"#REF!+(3*_xlfn.STDEV.P(#REF!,#REF!,#REF!))","v":{"$error":"#REF!"}},{"$f":"#REF!-(3*_xlfn.STDEV.P(#REF!,#REF!,#REF!))","v":{"$error":"#REF!"}},{"$f":"AVERAGE(#REF!)","v":{"$error":"#REF!"}},{"$f":"#REF!","v":{"$error":"#REF!"}},{"$f":"#REF!","v":{"$error":"#REF!"}},{"$f":"#REF!","v":{"$error":"#REF!"}},null,{"$f":"+#REF!","v":{"$error":"#REF!"}}]
[null,null,null,10,{"$f":"#REF!+(3*_xlfn.STDEV.P(#REF!,#REF!,#REF!))","v":{"$error":"#REF!"}},{"$f":"#REF!-(3*_xlfn.STDEV.P(#REF!,#REF!,#REF!))","v":{"$error":"#REF!"}},{"$f":"AVERAGE(#REF!)","v":{"$error":"#REF!"}},{"$f":"#REF!","v":{"$error":"#REF!"}},{"$f":"#REF!","v":{"$error":"#REF!"}},{"$f":"#REF!","v":{"$error":"#REF!"}},null,{"$f":"+#REF!","v":{"$error":"#REF!"}}]
[]
[]
[null,null,null,null,"UCL a","LCL a","avarage",{"$f":"#REF!","v":{"$error":"#REF!"}},{"$f":"#REF!","v":{"$error":"#REF!"}},{"$f":"#REF!","v":{"$error":"#REF!"}},null,"UCL r"]
[null,null,null,1,{"$f":"#REF!+(3*_xlfn.STDEV.P(#REF!,#REF!,#REF!))","v":{"$error":"#REF!"}},{"$f":"#REF!-(3*_xlfn.STDEV.P(#REF!,#REF!,#REF!))","v":{"$error":"#REF!"}},{"$f":"AVERAGE(#REF!)","v":{"$error":"#REF!"}},{"$f":"#REF!","v":{"$error":"#REF!"}},{"$f":"#REF!","v":{"$error":"#REF!"}},{"$f":"#REF!","v":{"$error":"#REF!"}},null,{"$f":"+#REF!","v":{"$error":"#REF!"}}]
[null,null,null,2,{"$f":"#REF!+(3*_xlfn.STDEV.P(#REF!,#REF!,#REF!))","v":{"$error":"#REF!"}},{"$f":"#REF!-(3*_xlfn.STDEV.P(#REF!,#REF!,#REF!))","v":{"$error":"#REF!"}},{"$f":"AVERAGE(#REF!)","v":{"$error":"#REF!"}},{"$f":"#REF!","v":{"$error":"#REF!"}},{"$f":"#REF!","v":{"$error":"#REF!"}},{"$f":"#REF!","v":{"$error":"#REF!"}},null,{"$f":"+#REF!","v":{"$error":"#REF!"}}]
[null,null,null,3,{"$f":"#REF!+(3*_xlfn.STDEV.P(#REF!,#REF!,#REF!))","v":{"$error":"#REF!"}},{"$f":"#REF!-(3*_xlfn.STDEV.P(#REF!,#REF!,#REF!))","v":{"$error":"#REF!"}},{"$f":"AVERAGE(#REF!)","v":{"$error":"#REF!"}},{"$f":"#REF!","v":{"$error":"#REF!"}},{"$f":"#REF!","v":{"$error":"#REF!"}},{"$f":"#REF!","v":{"$error":"#REF!"}},null,{"$f":"+#REF!","v":{"$error":"#REF!"}}]
[null,null,null,4,{"$f":"#REF!+(3*_xlfn.STDEV.P(#REF!,#REF!,#REF!))","v":{"$error":"#REF!"}},{"$f":"#REF!-(3*_xlfn.STDEV.P(#REF!,#REF!,#REF!))","v":{"$error":"#REF!"}},{"$f":"AVERAGE(#REF!)","v":{"$error":"#REF!"}},{"$f":"#REF!","v":{"$error":"#REF!"}},{"$f":"#REF!","v":{"$error":"#REF!"}},{"$f":"#REF!","v":{"$error":"#REF!"}},null,{"$f":"+#REF!","v":{"$error":"#REF!"}}]
[null,null,null,5,{"$f":"#REF!+(3*_xlfn.STDEV.P(#REF!,#REF!,#REF!))","v":{"$error":"#REF!"}},{"$f":"#REF!-(3*_xlfn.STDEV.P(#REF!,#REF!,#REF!))","v":{"$error":"#REF!"}},{"$f":"AVERAGE(#REF!)","v":{"$error":"#REF!"}},{"$f":"#REF!","v":{"$error":"#REF!"}},{"$f":"#REF!","v":{"$error":"#REF!"}},{"$f":"#REF!","v":{"$error":"#REF!"}},null,{"$f":"+#REF!","v":{"$error":"#REF!"}}]
[null,null,null,6,{"$f":"#REF!+(3*_xlfn.STDEV.P(#REF!,#REF!,#REF!))","v":{"$error":"#REF!"}},{"$f":"#REF!-(3*_xlfn.STDEV.P(#REF!,#REF!,#REF!))","v":{"$error":"#REF!"}},{"$f":"AVERAGE(#REF!)","v":{"$error":"#REF!"}},{"$f":"#REF!","v":{"$error":"#REF!"}},{"$f":"#REF!","v":{"$error":"#REF!"}},{"$f":"#REF!","v":{"$error":"#REF!"}},null,{"$f":"+#REF!","v":{"$error":"#REF!"}}]
[null,null,null,7,{"$f":"#REF!+(3*_xlfn.STDEV.P(#REF!,#REF!,#REF!))","v":{"$error":"#REF!"}},{"$f":"#REF!-(3*_xlfn.STDEV.P(#REF!,#REF!,#REF!))","v":{"$error":"#REF!"}},{"$f":"AVERAGE(#REF!)","v":{"$error":"#REF!"}},{"$f":"#REF!","v":{"$error":"#REF!"}},{"$f":"#REF!","v":{"$error":"#REF!"}},{"$f":"#REF!","v":{"$error":"#REF!"}},null,{"$f":"+#REF!","v":{"$error":"#REF!"}}]
[null,null,null,8,{"$f":"#REF!+(3*_xlfn.STDEV.P(#REF!,#REF!,#REF!))","v":{"$error":"#REF!"}},{"$f":"#REF!-(3*_xlfn.STDEV.P(#REF!,#REF!,#REF!))","v":{"$error":"#REF!"}},{"$f":"AVERAGE(#REF!)","v":{"$error":"#REF!"}},{"$f":"#REF!","v":{"$error":"#REF!"}},{"$f":"#REF!","v":{"$error":"#REF!"}},{"$f":"#REF!","v":{"$error":"#REF!"}},null,{"$f":"+#REF!","v":{"$error":"#REF!"}}]
[null,null,null,9,{"$f":"#REF!+(3*_xlfn.STDEV.P(#REF!,#REF!,#REF!))","v":{"$error":"#REF!"}},{"$f":"#REF!-(3*_xlfn.STDEV.P(#REF!,#REF!,#REF!))","v":{"$error":"#REF!"}},{"$f":"AVERAGE(#REF!)","v":{"$error":"#REF!"}},{"$f":"#REF!","v":{"$error":"#REF!"}},{"$f":"#REF!","v":{"$error":"#REF!"}},{"$f":"#REF!","v":{"$error":"#REF!"}},null,{"$f":"+#REF!","v":{"$error":"#REF!"}}]
[null,null,null,10,{"$f":"#REF!+(3*_xlfn.STDEV.P(#REF!,#REF!,#REF!))","v":{"$error":"#REF!"}},{"$f":"#REF!-(3*_xlfn.STDEV.P(#REF!,#REF!,#REF!))","v":{"$error":"#REF!"}},{"$f":"AVERAGE(#REF!)","v":{"$error":"#REF!"}},{"$f":"#REF!","v":{"$error":"#REF!"}},{"$f":"#REF!","v":{"$error":"#REF!"}},{"$f":"#REF!","v":{"$error":"#REF!"}},null,{"$f":"+#REF!","v":{"$error":"#REF!"}}]
[]
[]
[null,null,null,null,"UCL a","LCL a","avarage",{"$f":"#REF!","v":{"$error":"#REF!"}},{"$f":"#REF!","v":{"$error":"#REF!"}},{"$f":"#REF!","v":{"$error":"#REF!"}},null,"UCL r"]
[null,null,null,1,{"$f":"#REF!+(3*_xlfn.STDEV.P(#REF!,#REF!,#REF!))","v":{"$error":"#REF!"}},{"$f":"#REF!-(3*_xlfn.STDEV.P(#REF!,#REF!,#REF!))","v":{"$error":"#REF!"}},{"$f":"AVERAGE(#REF!)","v":{"$error":"#REF!"}},{"$f":"#REF!","v":{"$error":"#REF!"}},{"$f":"#REF!","v":{"$error":"#REF!"}},{"$f":"#REF!","v":{"$error":"#REF!"}},null,{"$f":"+#REF!","v":{"$error":"#REF!"}}]
[null,null,null,2,{"$f":"#REF!+(3*_xlfn.STDEV.P(#REF!,#REF!,#REF!))","v":{"$error":"#REF!"}},{"$f":"#REF!-(3*_xlfn.STDEV.P(#REF!,#REF!,#REF!))","v":{"$error":"#REF!"}},{"$f":"AVERAGE(#REF!)","v":{"$error":"#REF!"}},{"$f":"#REF!","v":{"$error":"#REF!"}},{"$f":"#REF!","v":{"$error":"#REF!"}},{"$f":"#REF!","v":{"$error":"#REF!"}},null,{"$f":"+#REF!","v":{"$error":"#REF!"}}]
[null,null,null,3,{"$f":"#REF!+(3*_xlfn.STDEV.P(#REF!,#REF!,#REF!))","v":{"$error":"#REF!"}},{"$f":"#REF!-(3*_xlfn.STDEV.P(#REF!,#REF!,#REF!))","v":{"$error":"#REF!"}},{"$f":"AVERAGE(#REF!)","v":{"$error":"#REF!"}},{"$f":"#REF!","v":{"$error":"#REF!"}},{"$f":"#REF!","v":{"$error":"#REF!"}},{"$f":"#REF!","v":{"$error":"#REF!"}},null,{"$f":"+#REF!","v":{"$error":"#REF!"}}]
[null,null,null,4,{"$f":"#REF!+(3*_xlfn.STDEV.P(#REF!,#REF!,#REF!))","v":{"$error":"#REF!"}},{"$f":"#REF!-(3*_xlfn.STDEV.P(#REF!,#REF!,#REF!))","v":{"$error":"#REF!"}},{"$f":"AVERAGE(#REF!)","v":{"$error":"#REF!"}},{"$f":"#REF!","v":{"$error":"#REF!"}},{"$f":"#REF!","v":{"$error":"#REF!"}},{"$f":"#REF!","v":{"$error":"#REF!"}},null,{"$f":"+#REF!","v":{"$error":"#REF!"}}]
[null,null,null,5,{"$f":"#REF!+(3*_xlfn.STDEV.P(#REF!,#REF!,#REF!))","v":{"$error":"#REF!"}},{"$f":"#REF!-(3*_xlfn.STDEV.P(#REF!,#REF!,#REF!))","v":{"$error":"#REF!"}},{"$f":"AVERAGE(#REF!)","v":{"$error":"#REF!"}},{"$f":"#REF!","v":{"$error":"#REF!"}},{"$f":"#REF!","v":{"$error":"#REF!"}},{"$f":"#REF!","v":{"$error":"#REF!"}},null,{"$f":"+#REF!","v":{"$error":"#REF!"}}]
[null,null,null,6,{"$f":"#REF!+(3*_xlfn.STDEV.P(#REF!,#REF!,#REF!))","v":{"$error":"#REF!"}},{"$f":"#REF!-(3*_xlfn.STDEV.P(#REF!,#REF!,#REF!))","v":{"$error":"#REF!"}},{"$f":"AVERAGE(#REF!)","v":{"$error":"#REF!"}},{"$f":"#REF!","v":{"$error":"#REF!"}},{"$f":"#REF!","v":{"$error":"#REF!"}},{"$f":"#REF!","v":{"$error":"#REF!"}},null,{"$f":"+#REF!","v":{"$error":"#REF!"}}]
[null,null,null,7,{"$f":"#REF!+(3*_xlfn.STDEV.P(#REF!,#REF!,#REF!))","v":{"$error":"#REF!"}},{"$f":"#REF!-(3*_xlfn.STDEV.P(#REF!,#REF!,#REF!))","v":{"$error":"#REF!"}},{"$f":"AVERAGE(#REF!)","v":{"$error":"#REF!"}},{"$f":"#REF!","v":{"$error":"#REF!"}},{"$f":"#REF!","v":{"$error":"#REF!"}},{"$f":"#REF!","v":{"$error":"#REF!"}},null,{"$f":"+#REF!","v":{"$error":"#REF!"}}]
[null,null,null,8,{"$f":"#REF!+(3*_xlfn.STDEV.P(#REF!,#REF!,#REF!))","v":{"$error":"#REF!"}},{"$f":"#REF!-(3*_xlfn.STDEV.P(#REF!,#REF!,#REF!))","v":{"$error":"#REF!"}},{"$f":"AVERAGE(#REF!)","v":{"$error":"#REF!"}},{"$f":"#REF!","v":{"$error":"#REF!"}},{"$f":"#REF!","v":{"$error":"#REF!"}},{"$f":"#REF!","v":{"$error":"#REF!"}},null,{"$f":"+#REF!","v":{"$error":"#REF!"}}]
[null,null,null,9,{"$f":"#REF!+(3*_xlfn.STDEV.P(#REF!,#REF!,#REF!))","v":{"$error":"#REF!"}},{"$f":"#REF!-(3*_xlfn.STDEV.P(#REF!,#REF!,#REF!))","v":{"$error":"#REF!"}},{"$f":"AVERAGE(#REF!)","v":{"$error":"#REF!"}},{"$f":"#REF!","v":{"$error":"#REF!"}},{"$f":"#REF!","v":{"$error":"#REF!"}},{"$f":"#REF!","v":{"$error":"#REF!"}},null,{"$f":"+#REF!","v":{"$error":"#REF!"}}]
[null,null,null,10,{"$f":"#REF!+(3*_xlfn.STDEV.P(#REF!,#REF!,#REF!))","v":{"$error":"#REF!"}},{"$f":"#REF!-(3*_xlfn.STDEV.P(#REF!,#REF!,#REF!))","v":{"$error":"#REF!"}},{"$f":"AVERAGE(#REF!)","v":{"$error":"#REF!"}},{"$f":"#REF!","v":{"$error":"#REF!"}},{"$f":"#REF!","v":{"$error":"#REF!"}},{"$f":"#REF!","v":{"$error":"#REF!"}},null,{"$f":"+#REF!","v":{"$error":"#REF!"}}]
[]
[null,null,null,null,"UCL a","LCL a","avarage",{"$f":"#REF!","v":{"$error":"#REF!"}},{"$f":"#REF!","v":{"$error":"#REF!"}},{"$f":"#REF!","v":{"$error":"#REF!"}},null,"UCL r"]
[null,null,null,1,{"$f":"#REF!+(3*_xlfn.STDEV.P(#REF!,#REF!,#REF!))","v":{"$error":"#REF!"}},{"$f":"#REF!-(3*_xlfn.STDEV.P(#REF!,#REF!,#REF!))","v":{"$error":"#REF!"}},{"$f":"AVERAGE(#REF!)","v":{"$error":"#REF!"}},{"$f":"#REF!","v":{"$error":"#REF!"}},{"$f":"#REF!","v":{"$error":"#REF!"}},{"$f":"#REF!","v":{"$error":"#REF!"}},null,{"$f":"+#REF!","v":{"$error":"#REF!"}}]
[null,null,null,2,{"$f":"#REF!+(3*_xlfn.STDEV.P(#REF!,#REF!,#REF!))","v":{"$error":"#REF!"}},{"$f":"#REF!-(3*_xlfn.STDEV.P(#REF!,#REF!,#REF!))","v":{"$error":"#REF!"}},{"$f":"AVERAGE(#REF!)","v":{"$error":"#REF!"}},{"$f":"#REF!","v":{"$error":"#REF!"}},{"$f":"#REF!","v":{"$error":"#REF!"}},{"$f":"#REF!","v":{"$error":"#REF!"}},null,{"$f":"+#REF!","v":{"$error":"#REF!"}}]
[null,null,null,3,{"$f":"#REF!+(3*_xlfn.STDEV.P(#REF!,#REF!,#REF!))","v":{"$error":"#REF!"}},{"$f":"#REF!-(3*_xlfn.STDEV.P(#REF!,#REF!,#REF!))","v":{"$error":"#REF!"}},{"$f":"AVERAGE(#REF!)","v":{"$error":"#REF!"}},{"$f":"#REF!","v":{"$error":"#REF!"}},{"$f":"#REF!","v":{"$error":"#REF!"}},{"$f":"#REF!","v":{"$error":"#REF!"}},null,{"$f":"+#REF!","v":{"$error":"#REF!"}}]
[null,null,null,4,{"$f":"#REF!+(3*_xlfn.STDEV.P(#REF!,#REF!,#REF!))","v":{"$error":"#REF!"}},{"$f":"#REF!-(3*_xlfn.STDEV.P(#REF!,#REF!,#REF!))","v":{"$error":"#REF!"}},{"$f":"AVERAGE(#REF!)","v":{"$error":"#REF!"}},{"$f":"#REF!","v":{"$error":"#REF!"}},{"$f":"#REF!","v":{"$error":"#REF!"}},{"$f":"#REF!","v":{"$error":"#REF!"}},null,{"$f":"+#REF!","v":{"$error":"#REF!"}}]
[null,null,null,5,{"$f":"#REF!+(3*_xlfn.STDEV.P(#REF!,#REF!,#REF!))","v":{"$error":"#REF!"}},{"$f":"#REF!-(3*_xlfn.STDEV.P(#REF!,#REF!,#REF!))","v":{"$error":"#REF!"}},{"$f":"AVERAGE(#REF!)","v":{"$error":"#REF!"}},{"$f":"#REF!","v":{"$error":"#REF!"}},{"$f":"#REF!","v":{"$error":"#REF!"}},{"$f":"#REF!","v":{"$error":"#REF!"}},null,{"$f":"+#REF!","v":{"$error":"#REF!"}}]
[null,null,null,6,{"$f":"#REF!+(3*_xlfn.STDEV.P(#REF!,#REF!,#REF!))","v":{"$error":"#REF!"}},{"$f":"#REF!-(3*_xlfn.STDEV.P(#REF!,#REF!,#REF!))","v":{"$error":"#REF!"}},{"$f":"AVERAGE(#REF!)","v":{"$error":"#REF!"}},{"$f":"#REF!","v":{"$error":"#REF!"}},{"$f":"#REF!","v":{"$error":"#REF!"}},{"$f":"#REF!","v":{"$error":"#REF!"}},null,{"$f":"+#REF!","v":{"$error":"#REF!"}}]
[null,null,null,7,{"$f":"#REF!+(3*_xlfn.STDEV.P(#REF!,#REF!,#REF!))","v":{"$error":"#REF!"}},{"$f":"#REF!-(3*_xlfn.STDEV.P(#REF!,#REF!,#REF!))","v":{"$error":"#REF!"}},{"$f":"AVERAGE(#REF!)","v":{"$error":"#REF!"}},{"$f":"#REF!","v":{"$error":"#REF!"}},{"$f":"#REF!","v":{"$error":"#REF!"}},{"$f":"#REF!","v":{"$error":"#REF!"}},null,{"$f":"+#REF!","v":{"$error":"#REF!"}}]
[null,null,null,8,{"$f":"#REF!+(3*_xlfn.STDEV.P(#REF!,#REF!,#REF!))","v":{"$error":"#REF!"}},{"$f":"#REF!-(3*_xlfn.STDEV.P(#REF!,#REF!,#REF!))","v":{"$error":"#REF!"}},{"$f":"AVERAGE(#REF!)","v":{"$error":"#REF!"}},{"$f":"#REF!","v":{"$error":"#REF!"}},{"$f":"#REF!","v":{"$error":"#REF!"}},{"$f":"#REF!","v":{"$error":"#REF!"}},null,{"$f":"+#REF!","v":{"$error":"#REF!"}}]
[null,null,null,9,{"$f":"#REF!+(3*_xlfn.STDEV.P(#REF!,#REF!,#REF!))","v":{"$error":"#REF!"}},{"$f":"#REF!-(3*_xlfn.STDEV.P(#REF!,#REF!,#REF!))","v":{"$error":"#REF!"}},{"$f":"AVERAGE(#REF!)","v":{"$error":"#REF!"}},{"$f":"#REF!","v":{"$error":"#REF!"}},{"$f":"#REF!","v":{"$error":"#REF!"}},{"$f":"#REF!","v":{"$error":"#REF!"}},null,{"$f":"+#REF!","v":{"$error":"#REF!"}}]
[null,null,null,10,{"$f":"#REF!+(3*_xlfn.STDEV.P(#REF!,#REF!,#REF!))","v":{"$error":"#REF!"}},{"$f":"#REF!-(3*_xlfn.STDEV.P(#REF!,#REF!,#REF!))","v":{"$error":"#REF!"}},{"$f":"AVERAGE(#REF!)","v":{"$error":"#REF!"}},{"$f":"#REF!","v":{"$error":"#REF!"}},{"$f":"#REF!","v":{"$error":"#REF!"}},{"$f":"#REF!","v":{"$error":"#REF!"}},null,{"$f":"+#REF!","v":{"$error":"#REF!"}}]
[]
[null,null,null,null,"UCL a","LCL a","avarage",{"$f":"#REF!","v":{"$error":"#REF!"}},{"$f":"#REF!","v":{"$error":"#REF!"}},{"$f":"#REF!","v":{"$error":"#REF!"}},null,"UCL r"]
[null,null,null,1,{"$f":"#REF!+(3*_xlfn.STDEV.P(#REF!,#REF!,#REF!))","v":{"$error":"#REF!"}},{"$f":"#REF!-(3*_xlfn.STDEV.P(#REF!,#REF!,#REF!))","v":{"$error":"#REF!"}},{"$f":"AVERAGE(#REF!)","v":{"$error":"#REF!"}},{"$f":"#REF!","v":{"$error":"#REF!"}},{"$f":"#REF!","v":{"$error":"#REF!"}},{"$f":"#REF!","v":{"$error":"#REF!"}},null,{"$f":"+#REF!","v":{"$error":"#REF!"}}]
[null,null,null,2,{"$f":"#REF!+(3*_xlfn.STDEV.P(#REF!,#REF!,#REF!))","v":{"$error":"#REF!"}},{"$f":"#REF!-(3*_xlfn.STDEV.P(#REF!,#REF!,#REF!))","v":{"$error":"#REF!"}},{"$f":"AVERAGE(#REF!)","v":{"$error":"#REF!"}},{"$f":"#REF!","v":{"$error":"#REF!"}},{"$f":"#REF!","v":{"$error":"#REF!"}},{"$f":"#REF!","v":{"$error":"#REF!"}},null,{"$f":"+#REF!","v":{"$error":"#REF!"}}]
[null,null,null,3,{"$f":"#REF!+(3*_xlfn.STDEV.P(#REF!,#REF!,#REF!))","v":{"$error":"#REF!"}},{"$f":"#REF!-(3*_xlfn.STDEV.P(#REF!,#REF!,#REF!))","v":{"$error":"#REF!"}},{"$f":"AVERAGE(#REF!)","v":{"$error":"#REF!"}},{"$f":"#REF!","v":{"$error":"#REF!"}},{"$f":"#REF!","v":{"$error":"#REF!"}},{"$f":"#REF!","v":{"$error":"#REF!"}},null,{"$f":"+#REF!","v":{"$error":"#REF!"}}]
[null,null,null,4,{"$f":"#REF!+(3*_xlfn.STDEV.P(#REF!,#REF!,#REF!))","v":{"$error":"#REF!"}},{"$f":"#REF!-(3*_xlfn.STDEV.P(#REF!,#REF!,#REF!))","v":{"$error":"#REF!"}},{"$f":"AVERAGE(#REF!)","v":{"$error":"#REF!"}},{"$f":"#REF!","v":{"$error":"#REF!"}},{"$f":"#REF!","v":{"$error":"#REF!"}},{"$f":"#REF!","v":{"$error":"#REF!"}},null,{"$f":"+#REF!","v":{"$error":"#REF!"}}]
[null,null,null,5,{"$f":"#REF!+(3*_xlfn.STDEV.P(#REF!,#REF!,#REF!))","v":{"$error":"#REF!"}},{"$f":"#REF!-(3*_xlfn.STDEV.P(#REF!,#REF!,#REF!))","v":{"$error":"#REF!"}},{"$f":"AVERAGE(#REF!)","v":{"$error":"#REF!"}},{"$f":"#REF!","v":{"$error":"#REF!"}},{"$f":"#REF!","v":{"$error":"#REF!"}},{"$f":"#REF!","v":{"$error":"#REF!"}},null,{"$f":"+#REF!","v":{"$error":"#REF!"}}]
[null,null,null,6,{"$f":"#REF!+(3*_xlfn.STDEV.P(#REF!,#REF!,#REF!))","v":{"$error":"#REF!"}},{"$f":"#REF!-(3*_xlfn.STDEV.P(#REF!,#REF!,#REF!))","v":{"$error":"#REF!"}},{"$f":"AVERAGE(#REF!)","v":{"$error":"#REF!"}},{"$f":"#REF!","v":{"$error":"#REF!"}},{"$f":"#REF!","v":{"$error":"#REF!"}},{"$f":"#REF!","v":{"$error":"#REF!"}},null,{"$f":"+#REF!","v":{"$error":"#REF!"}}]
[null,null,null,7,{"$f":"#REF!+(3*_xlfn.STDEV.P(#REF!,#REF!,#REF!))","v":{"$error":"#REF!"}},{"$f":"#REF!-(3*_xlfn.STDEV.P(#REF!,#REF!,#REF!))","v":{"$error":"#REF!"}},{"$f":"AVERAGE(#REF!)","v":{"$error":"#REF!"}},{"$f":"#REF!","v":{"$error":"#REF!"}},{"$f":"#REF!","v":{"$error":"#REF!"}},{"$f":"#REF!","v":{"$error":"#REF!"}},null,{"$f":"+#REF!","v":{"$error":"#REF!"}}]
[null,null,null,8,{"$f":"#REF!+(3*_xlfn.STDEV.P(#REF!,#REF!,#REF!))","v":{"$error":"#REF!"}},{"$f":"#REF!-(3*_xlfn.STDEV.P(#REF!,#REF!,#REF!))","v":{"$error":"#REF!"}},{"$f":"AVERAGE(#REF!)","v":{"$error":"#REF!"}},{"$f":"#REF!","v":{"$error":"#REF!"}},{"$f":"#REF!","v":{"$error":"#REF!"}},{"$f":"#REF!","v":{"$error":"#REF!"}},null,{"$f":"+#REF!","v":{"$error":"#REF!"}}]
[null,null,null,9,{"$f":"#REF!+(3*_xlfn.STDEV.P(#REF!,#REF!,#REF!))","v":{"$error":"#REF!"}},{"$f":"#REF!-(3*_xlfn.STDEV.P(#REF!,#REF!,#REF!))","v":{"$error":"#REF!"}},{"$f":"AVERAGE(#REF!)","v":{"$error":"#REF!"}},{"$f":"#REF!","v":{"$error":"#REF!"}},{"$f":"#REF!","v":{"$error":"#REF!"}},{"$f":"#REF!","v":{"$error":"#REF!"}},null,{"$f":"+#REF!","v":{"$error":"#REF!"}}]
[null,null,null,10,{"$f":"#REF!+(3*_xlfn.STDEV.P(#REF!,#REF!,#REF!))","v":{"$error":"#REF!"}},{"$f":"#REF!-(3*_xlfn.STDEV.P(#REF!,#REF!,#REF!))","v":{"$error":"#REF!"}},{"$f":"AVERAGE(#REF!)","v":{"$error":"#REF!"}},{"$f":"#REF!","v":{"$error":"#REF!"}},{"$f":"#REF!","v":{"$error":"#REF!"}},{"$f":"#REF!","v":{"$error":"#REF!"}},null,{"$f":"+#REF!","v":{"$error":"#REF!"}}]

{"sheet":"15) Measurement System Analysis","index":26,"n_rows":28,"n_cols":18,"rows_kept":28,"cut":false,"hidden":false,"merged":[[14,9,14,11],[5,4,5,5],[6,4,6,5],[7,4,7,5],[8,4,8,5],[9,4,9,5]]}
[]
[]
[]
[null,null,null,"GENERAL INFORMATION",null,null,null,null,"UPLOADS"]
[]
[null,null,null,null,null,null,null,null,"File(s)"]
[]
[]
[]
[]
[]
[null,null,null,null,null,null,null,null,"Attached file(s)",null,null,0]
[null,"Section",null,"SHEET SPECIFIC INFORMATION"]
[]
[null,null,null,"No.","Gauge Name","Gauge Number","Resolution","MSA Type","MSA Result","Uploads*",null,null,null,null,null,null,null,"*Double click to change"]
[null,null,"V"]
[null,null,"V"]
[null,null,"V"]
[null,null,"V"]
[null,null,"V"]
[null,null,"V"]
[null,null,"V"]
[null,null,"V"]
[null,null,"V"]
[null,null,"V"]
[null,null,"V"]
[null,null,"V"]
[null,null,"V"]

{"sheet":"16) Packaging Test Report","index":27,"n_rows":39,"n_cols":15,"rows_kept":39,"cut":false,"hidden":false,"merged":[[16,6,16,9],[20,6,20,9],[22,6,22,9],[24,6,24,9],[5,5,5,6],[6,5,6,6],[7,5,7,6],[8,5,8,6],[9,5,9,6],[18,6,18,9]]}
[]
[]
[]
[null,null,null,"GENERAL INFORMATION",null,null,null,null,null,null,null,null,null,"UPLOADS"]
[]
[null,null,null,null,null,null,null,null,null,null,null,null,null,"File(s)"]
[]
[]
[]
[]
[]
[null,null,null,null,null,null,null,null,null,null,null,null,null,"Attached file(s)",0]
[null,"Section",null,{"$f":"UPPER(\"Sheet specific INFORMATION\")","v":"SHEET SPECIFIC INFORMATION"}]
[null,{"$f":"OFFSET(B13,-1,)+1","v":1}]
[null,{"$f":"OFFSET(B15,-1,)","v":1},null,"Packaging Test Report\n"]
[null,{"$f":"OFFSET(B16,-1,)","v":1}]
[null,1,null,"Ref. No."]
[null,1]
[null,1,null,"Net Weight"]
[null,1]
[null,1,null,"Package Size"]
[null,1]
[null,1,null,"Palletized/Not Palletized"]
[null,1]
[null,1,null,"Package Material"]
[null,1]
[null,1,null,"Test results",null,"Pass / Fail","Remarks","Uploads*",null,null,null,null,"*Double click to change"]
[null,1,"v",1,"Vibration Test"]
[null,1,"v",1,"Vibration Test"]
[null,1,"v",2,"Shock Drop Height"]
[null,1,"v",3,"Impact Test"]
[null,1,"v",4,"Compression (Stackability)"]
[null,1,"v",5,"Fork Lift Handling"]
[null,1,"v",6,"International Conditioning (Temp/RH)"]
[null,1,"v"]
[null,1,"v"]
[null,1,"v"]
[null,1,"v"]
[null,1]

{"sheet":"17) Product- and Master Sample","index":28,"n_rows":34,"n_cols":18,"rows_kept":34,"cut":false,"hidden":false,"merged":[[18,4,18,7],[20,4,20,7],[16,4,16,7]]}
[]
[]
[]
[null,"GENERAL INFORMATION",null,null,null,null,null,null,null,null,null,null,null,null,null,"UPLOADS"]
[]
[null,null,null,null,null,null,null,null,null,null,null,null,null,null,null,"File(s)"]
[]
[]
[]
[]
[]
[null,null,null,null,null,null,null,null,null,null,null,null,null,null,null,"Attached file(s)",null,0]
[null,{"$f":"UPPER(\"Sheet specific INFORMATION\")","v":"SHEET SPECIFIC INFORMATION"}]
[]
[null,"Product and Master Sample\n"]
[]
[null,"PO Number"]
[]
[null,"Purchase Order Number (delivery)"]
[]
[null,"Sample Type"]
[]
[]
[]
[]
[]
[]
[]
[]
[]
[]
[]
[]
[null,null,null,null,null,null,null,null,null,null,null," "]

{"sheet":"18) Part Submission Warrant","index":29,"n_rows":85,"n_cols":26,"rows_kept":85,"cut":false,"hidden":false,"merged":[[77,13,77,16],[74,8,74,14],[78,3,78,8],[18,7,18,8],[71,3,71,8],[71,10,71,11],[71,12,71,18],[53,11,53,15],[62,7,62,18],[63,7,63,18],[65,11,65,18],[67,7,67,16],[69,4,69,8],[69,12,69,15],[69,16,69,17],[42,3,42,18],[85,13,85,18],[78,13,78,18],[79,13,79,18],[80,6,80,9],[80,13,80,18],[81,13,81,18],[82,6,82,9],[82,13,82,18],[83,13,83,18],[84,6,84,9],[84,13,84,18],[48,11,48,15],[49,11,49,15],[50,11,50,15],[51,11,51,15],[74,21,74,24],[54,11,54,15],[52,11,52,15],[35,13,35,17],[39,3,39,5],[40,3,40,18],[47,11,47,15],[43,3,43,18],[44,3,44,18],[45,11,45,15],[46,11,46,15],[35,3,35,7],[35,8,35,12],[5,4,5,8],[5,13,5,16],[7,1,7,4],[7,5,7,8],[7,13,7,16],[22,3,23,12],[22,17,25,18],[9,6,9,8],[9,13,9,16],[12,1,12,8],[12,10,12,17],[15,1,15,8],[15,10,15,17],[18,10,18,17],[18,1,18,3],[18,4,18,6]]}
[]
[]
[]
[]
[]
[null,"Part Name",null,null,{"$f":"VLOOKUP(\"D5\",rng_details,rng_details_input_col,FALSE)","v":0},null,null,null,null,"Customer Part No.",null,null,null," ",null,null,null,"Encl.",{"$f":"VLOOKUP(\"D13\",rng_details,rng_details_input_col,FALSE)","v":0},null,"UPLOADS"]
[null,null,null,null,null,null,null,null,null,null,null,null,null,null,null,null,null,null,null,null,"File(s)"]
[null,"Drawing No.",null,null,null,{"$f":"VLOOKUP(\"D11\",rng_details,rng_details_input_col,FALSE)","v":0},null,null,null,"Supplier Part No.",null,null,null," ",null,null,null,"Date",{"$f":"VLOOKUP(\"D16\",rng_details,rng_details_input_col,FALSE)","v":"00:00:00"}]
[]
[null,"Customer Drawing No.",null,null,null,null,null,null,null,"PPAP Po No.",null,null,null,{"$f":"VLOOKUP(\"D8\",rng_details,rng_details_input_col,FALSE)","v":0},null,null,null,"Weight"]
[]
[null,"SUPPLIER ORGANIZATION INFORMATION",null,null,null,null,null,null,null,null,"CUSTOMER ORGANIZATION INFORMATION"]
[null,{"$f":"VLOOKUP(\"D33\",rng_details,rng_details_input_col,FALSE)","v":0},null,null,null,{"$f":"VLOOKUP(\"D11\",rng_details,rng_details_input_col,FALSE)","v":0},null,null,null,null,{"$f":"VLOOKUP(\"D24\",rng_details,rng_details_input_col,FALSE)","v":0},null,null,null,{"$f":"VLOOKUP(\"D11\",rng_details,rng_details_input_col,FALSE)","v":0},null,null,null,null,null,"Attached file(s)",null,0]
[null,"Supplier Name",null,null,null,null,null," ",null,null,"Customer Name/Division"]
[]
[null,{"$f":"VLOOKUP(\"D35\",rng_details,rng_details_input_col,FALSE)","v":0},null,null,null,{"$f":"VLOOKUP(\"D11\",rng_details,rng_details_input_col,FALSE)","v":0},null,null,null,null,{"$f":"VLOOKUP(\"D22\",rng_details,rng_details_input_col,FALSE)","v":0},null,null,null,{"$f":"VLOOKUP(\"D11\",rng_details,rng_details_input_col,FALSE)","v":0}]
[null,"Street Address",null,null,null,null,null,null,null,null,"Customer Contact"]
[]
[null,{"$f":"VLOOKUP(\"D38\",rng_details,rng_details_input_col,FALSE)","v":0},null,null,{"$f":"VLOOKUP(\"D36\",rng_details,rng_details_input_col,FALSE)","v":0},null,null,{"$f":"VLOOKUP(\"D37\",rng_details,rng_details_input_col,FALSE)","v":0},null,null,{"$f":"VLOOKUP(\"D3\",rng_details,rng_details_input_col,FALSE)","v":0},null,null,null,{"$f":"VLOOKUP(\"D11\",rng_details,rng_details_input_col,FALSE)","v":0}]
[null,"Zip",null,null,"City",null,null,"Country",null,null,"Turbine type/name"]
[]
[null,null,null,null,null,null,null,null,null,null,null,null,null,null,null,null,null,"Comment"]
[null,"Note:",null,"Does this part contain prohibited or declarable substances according to REACH candidate list and/or REACH annex 14 + 17?",null,null,null,null,null,null,null,null,null,null,null,"YES"]
[]
[]
[null,"Note:",null,"Safety and/or Government Regulation?",null,null,null,null,null,null,null,null,null,null,null,"NO"]
[]
[null,"REASON FOR SUBMISSION (check at least one)*",null,null,null,null,null,null,null,null,null,null,null,null,null,null,null,null,null,null,null,null,null,null,null,"*Double click to change"]
[]
[null,null,null,"New part design",null,null,null,null,null,null,null,null,null,null,null,null,null,{"$f":" \"         Change of subcontractor (e.g. heat-treating, plating) that can or may affect form, fit, function, performance, and/or durability\"","v":"         Change of subcontractor (e.g. heat-treating, plating) that can or may affect form, fit, function, performance, and/or durability"}]
[null,null,null,"Engineering change to design, specification or material",null,null,null,null,null,null,null,null,null,null,null,null,null,{"$f":" \"         Activation of tooling after 12 months or more of inactive status\"","v":"         Activation of tooling after 12 months or more of inactive status"}]
[null,null,null,"Correction of discrepancy on a previous PPAP submission",null,null,null,null,null,null,null,null,null,null,null,null,null,{"$f":" \"         Product or process changes related to components of the production part that impacts form, fit, function, performance, and/or durability\"","v":"         Product or process changes related to components of the production part that impacts form, fit, function, performance, and/or durability"}]
[null,null,null,"Change of material or finishing",null,null,null,null,null,null,null,null,null,null,null,null,null,{"$f":" \"         Change in the inspection or test method\"","v":"         Change in the inspection or test method"}]
[null,null,null,"Production following refurbishment or rearrangement of existing tooling or equipment",null,null,null,null,null,null,null,null,null,null,null,null,null,{"$f":" \"         Changes in equipment, e.g. new equipment, additional equipment, replacement, or change in equipment size\"","v":"         Changes in equipment, e.g. new equipment, additional equipment, replacement, or change in equipment size"}]
[null,null,null,"Production from tooling or equipment moved to a different plant location"]
[]
[]
[null,"SUBMISSION LEVEL (Check one)*",null,null,null,null,null,null,null,null,null,null,null,null,null,null,null,null,null,null,null,null,null,null,null,"*Double click to change"]
[]
[null,null,null,"High risk level\n"]
[]
[null,null,null,"Medium risk level"]
[]
[null,null,null,"Low risk level"]
[]
[null,null,1,{"$f":"VLOOKUP(C46,'D) PPAP Submission Levels'!C:D,2,FALSE)","v":"New part design"},null,null,null,null,null,null,10,{"$f":"LEFT(VLOOKUP(K46,'D) PPAP Submission Levels'!C:D,2,FALSE),28)","v":"Process Capability Studies"},null,null,null,null,null,20,{"$f":"VLOOKUP(R46,'D) PPAP Submission Levels'!C:D,2,FALSE)","v":"Safety Data Sheet"}]
[null,null,2,{"$f":"VLOOKUP(C47,'D) PPAP Submission Levels'!C:D,2,FALSE)","v":"Team Feasibility Commitment, TFC"},null,null,null,null,null,null,11,{"$f":"LEFT(VLOOKUP(K47,'D) PPAP Submission Levels'!C:D,2,FALSE),28)","v":"Performance Test Report"},null,null,null,null,null,21,{"$f":"VLOOKUP(R47,'D) PPAP Submission Levels'!C:D,2,FALSE)","v":"Form, Fit and Function"}]
[null,null,3,{"$f":"VLOOKUP(C48,'D) PPAP Submission Levels'!C:D,2,FALSE)","v":"Design Failure Mode & Effect Analysis, DFMEA 3)"},null,null,null,null,null,null,12,{"$f":"LEFT(VLOOKUP(K48,'D) PPAP Submission Levels'!C:D,2,FALSE),28)","v":"Material Test Report"},null,null,null,null,null,22,{"$f":"VLOOKUP(R48,'D) PPAP Submission Levels'!C:D,2,FALSE)","v":"Qualified Laboratory Documentation"}]
[null,null,4,{"$f":"VLOOKUP(C49,'D) PPAP Submission Levels'!C:D,2,FALSE)","v":"Part History"},null,null,null,null,null,null,13,{"$f":"LEFT(VLOOKUP(K49,'D) PPAP Submission Levels'!C:D,2,FALSE),28)","v":"Dimension Test Report"},null,null,null,null,null,23,{"$f":"VLOOKUP(R49,'D) PPAP Submission Levels'!C:D,2,FALSE)","v":"List of Checking Aids"}]
[null,null,5,{"$f":"VLOOKUP(C50,'D) PPAP Submission Levels'!C:D,2,FALSE)","v":"Customer Engineering Approval"},null,null,null,null,null,null,14,{"$f":"LEFT(VLOOKUP(K50,'D) PPAP Submission Levels'!C:D,2,FALSE),28)","v":"Appearance Approval Report"},null,null,null,null,null,24,{"$f":"VLOOKUP(R50,'D) PPAP Submission Levels'!C:D,2,FALSE)","v":"Sub Supplier Source Details"}]
[null,null,6,{"$f":"VLOOKUP(C51,'D) PPAP Submission Levels'!C:D,2,FALSE)","v":"Process Flow Chart"},null,null,null,null,null,null,15,{"$f":"LEFT(VLOOKUP(K51,'D) PPAP Submission Levels'!C:D,2,FALSE),28)","v":"Measurement System Analysis"},null,null,null,null,null,25,{"$f":"VLOOKUP(R51,'D) PPAP Submission Levels'!C:D,2,FALSE)","v":"Type Name (in TOC)"}]
[null,null,7,{"$f":"VLOOKUP(C52,'D) PPAP Submission Levels'!C:D,2,FALSE)","v":"Factory Floor Plan"},null,null,null,null,null,null,16,{"$f":"LEFT(VLOOKUP(K52,'D) PPAP Submission Levels'!C:D,2,FALSE),28)","v":"Packaging Test Report"},null,null,null,null,null,26,{"$f":"VLOOKUP(R52,'D) PPAP Submission Levels'!C:D,2,FALSE)","v":"Type Name (in TOC)"}]
[null,null,8,{"$f":"VLOOKUP(C53,'D) PPAP Submission Levels'!C:D,2,FALSE)","v":"Process Failure Mode & Effect Analysis, PFMEA"},null,null,null,null,null,null,17,{"$f":"LEFT(VLOOKUP(K53,'D) PPAP Submission Levels'!C:D,2,FALSE),28)","v":"Product and Master Sample"},null,null,null,null,null,27,{"$f":"VLOOKUP(R53,'D) PPAP Submission Levels'!C:D,2,FALSE)","v":"Type Name (in TOC)"}]
[null,null,9,{"$f":"VLOOKUP(C54,'D) PPAP Submission Levels'!C:D,2,FALSE)","v":"Control Plan"},null,null,null,null,null,null,18,{"$f":"LEFT(VLOOKUP(K54,'D) PPAP Submission Levels'!C:D,2,FALSE),28)","v":"Part Submission Warrant, PSW"},null,null,null,null,null,28,{"$f":"VLOOKUP(R54,'D) PPAP Submission Levels'!C:D,2,FALSE)","v":"Type Name (in TOC)"}]
[null,null,null,null,null,null,null,null,null,null,19,{"$f":"LEFT(VLOOKUP(K55,'D) PPAP Submission Levels'!C:D,2,FALSE),28)","v":"Part Submission Warrant, Dev"},null,null,null,null,null,29,{"$f":"VLOOKUP(R55,'D) PPAP Submission Levels'!C:D,2,FALSE)","v":"Type Name (in TOC)"}]
[]
[null,"DECLARATION"]
[null,"I confirm that the samples represented by this warrant are representative of our parts and have been made to the relevant customer"]
[null,"drawings and specifications, and are made from specified materials on regular production tooling with no operations other than the regular"]
[null,"production process. I also certify that documented evidence of such compliance is on file and available for review."]
[null,"I have noted any deviation from this declaration below."]
[]
[null,"EXPLANATION/COMMENTS"]
[]
[]
[null,"List deviations and reference to PSW deviation report:"]
[]
[null,"Organization Authorized Signature",null,null,null,null,null,null,null,null,null,null,null,null,null,null,null,"Date"]
[]
[null,"Print Name",null,null,null,null,null,null,null,null,"Phone No.",null,null,null,null,null,"Fax"]
[]
[null,"Title",null,null,null,null,null,null,null,null,"e-mail"]
[]
[]
[null,"PPAP Warrant Disposition*:",null,null,null,null,null,null,"FOR CUSTOMER USE ONLY ",null,null,null,null,null,null,null,null,null,null,null,null,"*Double click to change"]
[]
[null,null,null,"Product and process approved as submitted"]
[null,null,null,"Conditionally approved",null,null,null,null,null,null,null,null,null,"Comment:"]
[null,null,null,"Not approved"]
[]
[null,"Date"]
[]
[null,"Customer Signature"]
[]
[null,"Print Name"]

{"sheet":"19) PSW Deviation Sheet","index":30,"n_rows":38,"n_cols":15,"rows_kept":38,"cut":false,"hidden":false,"merged":[[34,4,34,5],[36,4,36,5],[8,5,8,6],[9,5,9,6],[28,4,28,5],[29,4,29,5],[32,4,32,5],[33,4,33,5],[20,3,20,4],[19,3,19,4],[23,3,23,4],[24,3,24,4],[35,4,35,5],[31,4,31,5],[30,4,30,5],[5,5,5,6],[6,5,6,6],[7,5,7,6]]}
[]
[]
[]
[null,null,null,"GENERAL INFORMATION",null,null,null,null,null,null,null,null,null,"UPLOADS"]
[]
[null,null,null,null,null,null,null,null,null,null,null,null,null,"File(s)"]
[]
[]
[]
[]
[]
[]
[null,null,null,null,null,null,null,null,null,null,null,null,null,"Attached file(s)",0]
[null,null,null,{"$f":"UPPER(\"Sheet specific INFORMATION\")","v":"SHEET SPECIFIC INFORMATION"}]
[]
[null,null,null,"PSW Deviation Sheet"]
[]
[null,null,null,"Customer Approver "]
[]
[null,null,null,"ID",null,"Name","Function","Company"]
[null,null,null,null,null,{"$f":"IFERROR(VLOOKUP(D21,tbl_names[],2,FALSE),\"\")","v":""},{"$f":"IFERROR(VLOOKUP(D21,tbl_names[],4,FALSE),\"\")","v":""},{"$f":"IFERROR(VLOOKUP(D21,tbl_names[],5,FALSE),\"\")","v":""}]
[null,null,null,"Supplier Approver "]
[]
[null,null,null,"ID",null,"Name","Function","Company"]
[null,null,null,null,null,{"$f":"IFERROR(VLOOKUP(D25,tbl_names[],2,FALSE),\"\")","v":""},{"$f":"IFERROR(VLOOKUP(D25,tbl_names[],4,FALSE),\"\")","v":""},{"$f":"IFERROR(VLOOKUP(D25,tbl_names[],5,FALSE),\"\")","v":""}]
[]
[]
[null,null,null,"Ref. No","Reason for Deviation",null,"Correction request","Remarks"]
[null,null,"v"]
[null,null,"v"]
[null,null,"v"]
[null,null,"v"]
[null,null,"v"]
[null,null,"v"]
[null,null,"v"]
[null,null,"v"]
[null,null,"v"]
[null,null,"v"]

{"sheet":"20) Safety Data Sheet (SDS)","index":31,"n_rows":30,"n_cols":12,"rows_kept":30,"cut":false,"hidden":false,"merged":[[29,1,34,3]]}
[]
[]
[]
[null,"GENERAL INFORMATION",null,null,null,null,null,null,null,"UPLOADS"]
[]
[null,null,null,null,null,null,null,null,null,"File(s)"]
[]
[]
[]
[]
[]
[null,null,null,null,null,null,null,null,null,"Attached file(s)",null,0]
[null,{"$f":"UPPER(\"Sheet specific INFORMATION\")","v":"SHEET SPECIFIC INFORMATION"}]
[]
[null,"Ref. no.","Remarks","Version"]
[]
[]
[]
[]
[]
[]
[]
[]
[]
[]
[]
[]
[]
[]
[null,"Can additionally include data sheets for declaration for transport of dangerous goods and prohibited/declarable substances (REACH, ROHS, F-gas, WEEE, Battery Directive)."]

{"sheet":"21) Form, Fit and Function","index":32,"n_rows":57,"n_cols":12,"rows_kept":57,"cut":false,"hidden":false,"merged":[[45,3,45,9],[5,5,5,6],[6,5,6,6],[7,5,7,6],[8,5,8,6],[9,5,9,6],[29,3,29,9],[15,3,15,4],[21,3,21,4],[22,3,22,4],[25,3,25,4],[26,3,26,4]]}
[]
[]
[]
[null,null,null,"GENERAL INFORMATION",null,null,null,null,null,"UPLOADS"]
[]
[null,null,null,null,null,null,null,null,null,"File(s)"]
[]
[]
[]
[]
[]
[null,null,null,null,null,null,null,null,null,"Attached file(s)",null,0]
[null,"Section","Validation",{"$f":"UPPER(\"Sheet specific INFORMATION\")","v":"SHEET SPECIFIC INFORMATION"}]
[]
[null,{"$f":"OFFSET(B15,-1,)+1","v":1}]
[null,{"$f":"OFFSET(B16,-1,)","v":1},null,"Form, Fit and Function\n"]
[null,{"$f":"OFFSET(B17,-1,)","v":1}]
[null,1,null,"Ref. No."]
[null,1]
[null,1,null,"Customer Approver "]
[null,1]
[null,1,null,"ID",null,"Name","Function","Company"]
[null,1,null,null,null,{"$f":"IFERROR(VLOOKUP(D23,tbl_names[],2,FALSE),\"\")","v":""},{"$f":"IFERROR(VLOOKUP(D23,tbl_names[],4,FALSE),\"\")","v":""},{"$f":"IFERROR(VLOOKUP(D23,tbl_names[],5,FALSE),\"\")","v":""}]
[null,1,null,"Supplier Approver "]
[null,1]
[null,1,null,"ID",null,"Name","Function","Company"]
[null,1,null,null,null,{"$f":"IFERROR(VLOOKUP(D27,tbl_names[],2,FALSE),\"\")","v":""},{"$f":"IFERROR(VLOOKUP(D27,tbl_names[],4,FALSE),\"\")","v":""},{"$f":"IFERROR(VLOOKUP(D27,tbl_names[],5,FALSE),\"\")","v":""}]
[null,1]
[null,1]
[null,1,null," FIT TEST"]
[null,1,null,"Test No.","Test Description","Test Result","Action Required","Responsible","Due Date","Observation"]
[null,1,"v"]
[null,1,"v"]
[null,1,"v"]
[null,1,"v"]
[null,1,"v"]
[null,1,"v"]
[null,1,"v"]
[null,1,"v"]
[null,1,"v"]
[null,1,"v"]
[null,1,"v"]
[null,1,"v"]
[null,1]
[null,1]
[null,1,null,"FUNCTION TEST"]
[null,1,null,"Test No.","Test Description","Test Result","Action Required","Responsible","Due Date","Observation"]
[null,1,"v"]
[null,1,"v"]
[null,1,"v"]
[null,1,"v"]
[null,1,"v"]
[null,1,"v"]
[null,1,"v"]
[null,1,"v"]
[null,1,"v"]
[null,1]

{"sheet":"22) Qualified Lab. Doc.","index":33,"n_rows":22,"n_cols":10,"rows_kept":22,"cut":false,"hidden":false,"merged":[[38,5,38,6],[38,8,38,9],[39,5,39,6],[39,8,39,9],[41,5,41,6],[41,8,41,9],[40,5,40,6],[40,8,40,9],[36,5,36,6],[36,8,36,9],[37,5,37,6],[37,8,37,9],[33,5,33,6],[33,8,33,9],[34,5,34,6],[34,8,34,9],[35,5,35,6],[35,8,35,9],[29,5,29,6],[29,8,29,9],[31,5,31,6],[31,8,31,9],[32,5,32,6],[32,8,32,9],[30,5,30,6],[30,8,30,9],[26,5,26,6],[26,8,26,9],[27,5,27,6],[27,8,27,9],[28,5,28,6],[28,8,28,9],[24,5,24,6],[24,8,24,9],[25,5,25,6],[25,8,25,9],[21,5,21,6],[21,8,21,9],[22,5,22,6],[22,8,22,9],[23,5,23,6],[23,8,23,9],[20,1,20,9],[15,1,15,9],[16,1,16,9],[17,1,17,9],[18,6,18,7],[19,1,19,9]]}
[]
[]
[]
[null,"GENERAL INFORMATION",null,null,null,null,null,null,"UPLOADS"]
[]
[null,null,null,null,null,null,null,null,"File(s)"]
[]
[]
[]
[]
[]
[null,null,null,null,null,null,null,null,"Attached file(s)",0]
[null,{"$f":"UPPER(\"Sheet specific INFORMATION\")","v":"SHEET SPECIFIC INFORMATION"}]
[]
[]
[null,"If the supplier is accredited to ISO/IEC 17025 or equivalent national standard, please attach accreditation."]
[null,"Detailed information"]
[]
[]
[null,"If the supplier is not accredited to ISO/IEC 17025 or equivalent national standard, please fill in the form. 'Laboratory' is defined as a facility for inspection, test or calibration that may include, but is not limited to, chemical, metallurgical, dimensional, physical, electrical or reliability testing."]
[null,"Detailed information"]
[null,"Current Equipment","Manufacturer","Type","Capability","Qualified Personnel to use the Equipment",null,"Use for","Procedure/Manual reference"]

{"sheet":"23) List of checking aids","index":34,"n_rows":15,"n_cols":8,"rows_kept":15,"cut":false,"hidden":false,"merged":[]}
[]
[]
[]
[null,"GENERAL INFORMATION",null,null,null,null,"UPLOADS"]
[]
[]
[]
[]
[]
[]
[]
[null,null,null,null,null,null,"Attached file(s)",0]
[null,{"$f":"UPPER(\"Sheet specific INFORMATION\")","v":"SHEET SPECIFIC INFORMATION"}]
[]
[null,"S. no.","Gauge / Instrument Name","ID of Gauge/Instrument","Calibrated On (Date)","Next Calibration Due Date","Remarks if any"]

{"sheet":"24) Sub Supplier Source Details","index":35,"n_rows":15,"n_cols":8,"rows_kept":15,"cut":false,"hidden":false,"merged":[]}
[]
[]
[]
[null,"GENERAL INFORMATION",null,null,null,null,"UPLOADS"]
[]
[]
[]
[]
[]
[]
[]
[null,null,null,null,null,null,"Attached file(s)",0]
[null,{"$f":"UPPER(\"Sheet specific INFORMATION\")","v":"SHEET SPECIFIC INFORMATION"}]
[]
[null,"S. no.","Part no.","Description","Sub Supplier Name","Sub Supplier Location","Remarks"]

{"sheet":"25) Type Name (in TOC)","index":36,"n_rows":13,"n_cols":24,"rows_kept":13,"cut":false,"hidden":false,"merged":[]}
[]
[]
[]
[null,null,"GENERAL INFORMATION"]
[]
[]
[]
[]
[]
[]
[]
[null,0,null,null,null,null,null,null,null,null,null,null,null,null,null,null,null,null,null,null,null,null,null,"Attached file(s)"]
[null,{"$f":"\"25) \"&rng_name_sandbox_1","v":"25) Type Name (in TOC)"},{"$f":"UPPER(\"Sheet specific INFORMATION\")","v":"SHEET SPECIFIC INFORMATION"}]

{"sheet":"26) Type Name (in TOC)","index":37,"n_rows":13,"n_cols":3,"rows_kept":13,"cut":false,"hidden":false,"merged":[]}
[]
[]
[]
[null,1,"GENERAL INFORMATION"]
[]
[]
[]
[]
[]
[null,"No attached"]
[null,0]
[]
[null,{"$f":"\"26) \"&rng_name_sandbox_2","v":"26) Type Name (in TOC)"},{"$f":"UPPER(\"Sheet specific INFORMATION\")","v":"SHEET SPECIFIC INFORMATION"}]

{"sheet":"27) Type Name (in TOC)","index":38,"n_rows":13,"n_cols":3,"rows_kept":13,"cut":false,"hidden":false,"merged":[]}
[]
[]
[]
[null,1,"GENERAL INFORMATION"]
[]
[]
[]
[]
[]
[null,"No attached"]
[null,0]
[]
[null,{"$f":"\"27) \"&rng_name_sandbox_3","v":"27) Type Name (in TOC)"},{"$f":"UPPER(\"Sheet specific INFORMATION\")","v":"SHEET SPECIFIC INFORMATION"}]

{"sheet":"28) Type Name (in TOC)","index":39,"n_rows":13,"n_cols":3,"rows_kept":13,"cut":false,"hidden":false,"merged":[]}
[]
[]
[]
[null,1,"GENERAL INFORMATION"]
[]
[]
[]
[]
[]
[null,"No attached"]
[null,0]
[]
[null,{"$f":"\"28) \"&rng_name_sandbox_4","v":"28) Type Name (in TOC)"},{"$f":"UPPER(\"Sheet specific INFORMATION\")","v":"SHEET SPECIFIC INFORMATION"}]

{"sheet":"29) Type Name (in TOC)","index":40,"n_rows":13,"n_cols":3,"rows_kept":13,"cut":false,"hidden":false,"merged":[]}
[]
[]
[]
[null,1,"GENERAL INFORMATION"]
[]
[]
[]
[]
[]
[null,"No attached"]
[null,0]
[]
[null,{"$f":"\"29) \"&rng_name_sandbox_5","v":"29) Type Name (in TOC)"},{"$f":"UPPER(\"Sheet specific INFORMATION\")","v":"SHEET SPECIFIC INFORMATION"}]