{"text_format":"1","workbook":"xlsx","n_sheets":41,"sheets":["TOC","SETUP","STATUS","A) Cover Page","A) Cover Page 2","B) Table of Content","INSTRUCTIONS","C) PPAP Details","D) PPAP Submission Levels","E) UPLOADS","F) Product Quality Team","1) Product Quality Plan","2) Team Feasibility Commtiment","3) D-FMEA","4) Part History","5) Customer Engineering Appr.","6) Process Flow Chart","7) Factory Floor Plan","8) P-FMEA","9) Control Plan","10) Process Capability Studies","11) Performance Test Report","12) Material Test Report","13) Dimensional Test Report","14) Appearance Approval Report","Calc_MSA","15) Measurement System Analysis","16) Packaging Test Report","17) Product- and Master Sample","18) Part Submission Warrant","19) PSW Deviation Sheet","20) Safety Data Sheet (SDS)","21) Form, Fit and Function","22) Qualified Lab. Doc.","23) List of checking aids","24) Sub Supplier Source Details","25) Type Name (in TOC)","26) Type Name (in TOC)","27) Type Name (in TOC)","28) Type Name (in TOC)","29) Type Name (in TOC)"],"not_rendered":{"charts":0,"images":45,"macros":1,"external_links":0,"defined_names":273,"comments":0,"pivot_tables":0},"unopened":[],"bounds":{"document_bytes":16777216,"sheet_cells":100000,"rows_first":2000,"rows_last":500,"rows_between":2000,"halvings":0,"cell_chars":16384,"cell_head_chars":4096},"cells_cut":0,"cells_raw":0,"read":"whole","date_system":"1900"}

{"sheet":"TOC","index":0,"n_rows":35,"n_cols":2,"rows_kept":35,"cut":false,"hidden":true,"merged":[]}
["Table of Contents","Sheet # – # of Pages"]
[null,"‘1"]
[null,"‘2"]
[null,"‘4"]
[null,"‘5"]
[null,"‘6"]
[null,"‘7"]
[null,"‘8"]
[null,"‘9"]
[null,"‘11"]
{"$rows_left_out":26}
{"sheet":"SETUP","index":1,"n_rows":25,"n_cols":24,"rows_kept":25,"cut":false,"hidden":true,"merged":[]}
[null,null,null,null,"Passeword","Windpower",null,null,null,null,null,null,null,1,1]
[]
[null,null,null,null,null,null,null,null,null,null,null,null,null,null,null,null,2]
[null,null,null,null,null,"SEV",null,"STATUS",null,"RISK",null,"Evaluation",null,"No.","Rank","TSP","Dropdown",null,null,"General information Name","Value",null,null,"Delete"]
[null,null,null,null,null,1,null,"Completed",null,"High Risk",null,"Passed",null,1,{"$f":"IF(P5<>0,1,)","v":0},{"$f":"INDIRECT(\"rng_tech_no_\"&N5)","v":0},{"$f":"IFERROR(VLOOKUP(N5,$O$5:$P$20,2,FALSE),\"\")","v":""},null,null,{"$f":"VLOOKUP(\"D24\",rng_details,rng_details_txt_col,FALSE)","v":"Customer Name"},{"$f":"VLOOKUP(\"D24\",rng_details,rng_details_input_col,FALSE)","v":0},null,null,"Apperance topic"]
[null,null,null,null,null,2,null,"Not Completed",null,"Medium Risk",null,"Failed",null,2,{"$f":"IF(P6<>0,1+O5,O5)","v":0},0,{"$f":"IFERROR(VLOOKUP(N6,$O$5:$P$20,2,FALSE),)","v":0},null,null,{"$f":"VLOOKUP(\"D33\",rng_details,rng_details_txt_col,FALSE)","v":"Supplier Name"},{"$f":"VLOOKUP(\"D33\",rng_details,rng_details_input_col,FALSE)","v":0},null,null,"Surface (Defects can include pinholes, runs, rust, scratch, crack impurities)"]
[null,null,null,null,null,3,null,"In Progress",null,"Low Risk",null,"N/A",null,3,0,0,0,null,null,{"$f":"VLOOKUP(\"D3\",rng_details,rng_details_txt_col,FALSE)","v":"Turbine Type/Name"},{"$f":"VLOOKUP(\"D3\",rng_details,rng_details_input_col,FALSE)","v":0},null,null,"Gloss Details for Painted Parts"]
[null,null,null,null,null,4,null,"N/A",null,null,null,null,null,4,0,0,0,null,null,{"$f":"VLOOKUP(\"D4\",rng_details,rng_details_txt_col,FALSE)","v":"Part Number"},{"$f":"VLOOKUP(\"D4\",rng_details,rng_details_input_col,FALSE)","v":0},null,null,"Graphics (Siemens, Safety, Part no, UL no, Moulders name etc)"]
[null,null,null,null,null,5,null,null,null,null,null,null,null,5,0,0,0,null,null,{"$f":"VLOOKUP(\"D5\",rng_details,rng_details_txt_col,FALSE)","v":"Part Name"},{"$f":"VLOOKUP(\"D5\",rng_details,rng_details_input_col,FALSE)&IF(VLOOKUP(\"D6\",rng_details,6,FALSE)<>\"\",(\" (\"&VLOOKUP(\"D6\",rng_details,6,FALSE)&\")\"),\"\")","v":""},null,null,"Texture (anti-slint)"]
[null,null,null,null,null,6,null,null,null,null,null,null,null,6,0,0,0,null,null,{"$f":"VLOOKUP(\"D9\",rng_details,rng_details_txt_col,FALSE)","v":"Technical Specification (TPS/ZPS no.)"},{"$f":"VLOOKUP(\"D9\",rng_details,rng_details_input_col,FALSE)","v":0},null,null,"RAL Shade Card details for Painted Parts"]
{"$rows_left_out":16}
{"sheet":"STATUS","index":2,"n_rows":8,"n_cols":18,"rows_kept":8,"cut":false,"hidden":true,"merged":[]}
[null,null,null,null,null,null,null,null,null,null,null,null,null,null,null,null,1,1]
[]
[]
[null,"Button text","Unlock Function",null,"Date of function in use",null,"By User",null,"Current Status"]
[]
[null,{"$f":"IF(rng_status_logo=\"Locked\",\" Logo Unlocked\",\"Logo Locked\")","v":"Logo Locked"},null,"Change logo"]
[]
[null,{"$f":"IF(rng_status_edit=\"Locked\",\"Edit Unlocked\",\" Edit Locked\")","v":" Edit Locked"},null,"Change format"]

{"sheet":"A) Cover Page","index":3,"n_rows":54,"n_cols":6,"rows_kept":54,"cut":false,"hidden":false,"merged":[[53,5,53,6],[51,14,51,19],[9,1,9,6],[43,3,43,5],[44,3,44,5],[46,3,46,6],[49,14,49,19],[50,2,50,5],[51,2,51,3]]}
[]
[]
[]
[]
[]
[]
[]
[]
[]
[]
{"$rows_left_out":45}
{"sheet":"A) Cover Page 2","index":4,"n_rows":37,"n_cols":4,"rows_kept":37,"cut":false,"hidden":false,"merged":[[1,2,1,3],[10,2,10,3],[13,2,13,3],[18,2,18,3],[47,2,47,3],[46,2,46,3],[21,2,21,3],[24,2,24,3],[25,2,25,3],[37,2,37,3],[38,2,38,3],[39,2,39,3],[40,2,40,3],[41,2,41,3],[42,2,42,3]]}
[]
[null,null,"APQP4Wind"]
[null,null,"Lysbrohøjen 24"]
[null,null,"8600 Silkeborg"]
[null,null,"Denmark"]
[]
[null,null,"Mail: contact@apqp4wind.org"]
[null,null,"Website: www.apqp4wind.org"]
[null,null,"LinkedIn: APQP4Wind"]
[]
{"$rows_left_out":28}
{"sheet":"B) Table of Content","index":5,"n_rows":39,"n_cols":9,"rows_kept":39,"cut":false,"hidden":false,"merged":[]}
[]
[]
[null,null,null,"½"]
[null,null,"Sl. No","Overview - Sheet names","  ","Page",null,null,"The page numbers will only be updated when a PDF-file is created."]
[null,"ws_PB"]
[null,"ws_PA"]
[null,"ws_PD_3","C","PPAP Submission Details",null,7,null,null,"*Go to the sheet by double clicking on the name"]
[null,"ws_PC","D","PPAP Submission Levels",null,9]
[null,"ws_uploads","E","Uploads",null,12]
[null,"ws_P34","F","Product Quality Team",null,14]
{"$rows_left_out":30}
{"sheet":"INSTRUCTIONS","index":6,"n_rows":60,"n_cols":5,"rows_kept":60,"cut":false,"hidden":false,"merged":[]}
[]
[]
[]
[]
[null,null,"NAVIGATION"]
[null,null,null,"Placed in the upper right corner of the sheet."]
[null,null,null,null,"Go to the next/previous visible sheet"]
[null,null,null,null,"Go to table of contents"]
[]
[null,null,"GENERAL INFORMATION"]
{"$rows_left_out":51}
{"sheet":"C) PPAP Details","index":7,"n_rows":48,"n_cols":20,"rows_kept":48,"cut":false,"hidden":false,"merged":[[9,4,10,4],[12,4,15,4]]}
[]
[]
[null,{"$f":"COLUMN(G7)-COLUMN(B5)+1","v":6},null,null,null,null,null,null,null,null,null,null,null,null,"UPLOADS"]
[null,{"$f":"COLUMN(E7)-COLUMN(B5)+1","v":4}]
[null,"D1","General info",null,"Submission Date:",null,null,null,"(dd-mm-yyyy)"]
[null,"D2"]
[null,"D3","Product information",null,"Turbine Type/Name"]
[null,"D4",null,null,"Part Number"]
[null,"D5",null,null,"Part Name",null,null,null,null,null,null,null,null,null,"Attached file(s)",null,null,null,null,0]
[null,"D6",null,null,"Products Covered in the PPAP Family"]
{"$rows_left_out":39}
{"sheet":"D) PPAP Submission Levels","index":8,"n_rows":63,"n_cols":16,"rows_kept":63,"cut":false,"hidden":false,"merged":[[26,10,27,10],[26,12,27,12],[5,4,5,8],[6,4,6,8],[26,2,27,3],[26,4,27,5],[26,6,27,7],[26,8,27,9],[26,11,27,11]]}
[]
[]
[]
[null,null,"GENERAL INFORMATION"]
[]
[]
[]
[]
[]
[]
{"$rows_left_out":54}
{"sheet":"E) UPLOADS","index":9,"n_rows":43,"n_cols":13,"rows_kept":43,"cut":false,"hidden":false,"merged":[]}
[]
[]
[]
[null,null,"GENERAL INFORMATION"]
[]
[]
[]
[]
[]
[]
{"$rows_left_out":34}
{"sheet":"F) Product Quality Team","index":10,"n_rows":17,"n_cols":10,"rows_kept":17,"cut":false,"hidden":false,"merged":[]}
[]
[]
[]
[null,null,null,"GENERAL INFORMATION",null,null,null,null,"UPLOADS"]
[]
[]
[]
[]
[]
[]
{"$rows_left_out":8}
{"sheet":"1) Product Quality Plan","index":11,"n_rows":83,"n_cols":14,"rows_kept":83,"cut":false,"hidden":false,"merged":[]}
[]
[]
[]
[null,null,null,"GENERAL INFORMATION",null,null,null,null,null,"UPLOADS"]
[]
[]
[]
[]
[]
[]
{"$rows_left_out":74}
{"sheet":"2) Team Feasibility Commtiment","index":12,"n_rows":64,"n_cols":18,"rows_kept":64,"cut":false,"hidden":false,"merged":[[15,1,15,14],[37,1,37,14],[6,10,6,15],[7,10,7,16],[8,10,8,15],[9,10,9,16]]}
[]
[]
[]
[null,"GENERAL INFORMATION",null,null,null,null,null,null,null,null,null,null,null,null,null,"UPLOADS"]
[]
[]
[]
[]
[]
[]
{"$rows_left_out":55}
{"sheet":"3) D-FMEA","index":13,"n_rows":70,"n_cols":23,"rows_kept":70,"cut":false,"hidden":false,"merged":[[42,16,42,22]]}
[]
[]
[]
[null,null,"GENERAL INFORMATION",null,null,null,null,null,null," UPLOADS"]
[]
[]
[]
[]
[]
[]
{"$rows_left_out":61}
{"sheet":"4) Part History","index":14,"n_rows":18,"n_cols":13,"rows_kept":18,"cut":false,"hidden":false,"merged":[[15,1,15,6],[5,3,5,4],[6,3,6,4],[7,3,7,4],[8,3,8,4],[9,3,9,4]]}
[]
[]
[]
[null,"GENERAL INFORMATION",null,null,null,null,null,null,"UPLOADS"]
[]
[null,null,null,null,null,null,null,null,"File(s)"]
[]
[]
[]
[]
{"$rows_left_out":9}
{"sheet":"5) Customer Engineering Appr.","index":15,"n_rows":34,"n_cols":18,"rows_kept":34,"cut":false,"hidden":false,"merged":[[19,4,19,6],[19,7,19,9],[32,1,32,9],[33,1,33,2],[33,3,33,9],[21,4,21,6],[21,7,21,9],[23,4,23,6],[23,7,23,9],[27,7,27,9],[29,7,29,9],[25,4,25,6],[25,7,25,9],[15,4,15,5],[15,7,15,9],[5,3,5,7],[6,3,6,7],[7,3,7,7],[8,3,8,7],[9,3,9,7],[15,1,15,3]]}
[]
[]
[]
[null,"GENERAL INFORMATION",null,null,null,null,null,null,null,null,null,null,null,null,null,"UPLOADS"]
[]
[null,null,null,null,null,null,null,null,null,null,null,null,null,null,null,"File(s)"]
[]
[]
[]
[]
{"$rows_left_out":25}
{"sheet":"6) Process Flow Chart","index":16,"n_rows":48,"n_cols":19,"rows_kept":48,"cut":false,"hidden":false,"merged":[[28,3,28,4],[29,3,29,4],[29,5,29,8],[28,9,28,11],[29,9,29,11],[9,7,9,12],[9,15,9,16],[16,3,16,11],[0,16,0,17],[5,7,5,12],[6,7,6,12],[7,7,7,12],[8,7,8,12],[8,15,8,16]]}
[]
[]
[]
[null,null,null,"GENERAL INFORMATION",null,null,null,null,null,null,null,null,null,null,null,null,"UPLOADS"]
[]
[null,null,null,null,null,null,null,null,null,null,null,null,null,null,null,null,"File(s)"]
[]
[]
[]
[]
{"$rows_left_out":39}
{"sheet":"7) Factory Floor Plan","index":17,"n_rows":27,"n_cols":16,"rows_kept":27,"cut":false,"hidden":false,"merged":[[15,1,15,2],[17,5,17,7],[19,5,19,7],[15,5,15,7],[21,5,21,7],[25,3,25,4],[26,3,26,4],[26,5,26,7],[25,5,25,7],[11,12,11,13],[5,3,5,4],[5,6,5,8],[5,9,5,11],[6,3,6,4],[6,6,6,8],[6,9,6,11],[9,3,9,4],[9,6,9,8],[9,9,9,10],[7,3,7,4],[7,6,7,8],[7,9,7,11],[8,3,8,4],[8,6,8,8],[8,9,8,10]]}
[]
[]
[]
[null,"GENERAL INFORMATION",null,null,null,null,null,null,null,null,null,null,"UPLOADS"]
[]
[null,null,null,null,null,null,null,null,null,null,null,null,"File(s)"]
[]
[]
[]
[]
{"$rows_left_out":18}
{"sheet":"8) P-FMEA","index":18,"n_rows":59,"n_cols":24,"rows_kept":59,"cut":false,"hidden":false,"merged":[[40,17,40,23]]}
[]
[]
[]
[null,null,"GENERAL INFORMATION",null,null,null,null,null,"UPLOADS"]
[]
[null,null,null,null,null,null,null,null,"File(s)"]
[]
[]
[]
[]
{"$rows_left_out":50}
{"sheet":"9) Control Plan","index":19,"n_rows":73,"n_cols":17,"rows_kept":73,"cut":false,"hidden":false,"merged":[[45,5,45,7],[45,12,45,13],[45,15,45,16],[5,5,5,6],[6,5,6,6],[7,5,7,6],[44,2,44,8],[44,9,44,16]]}
[]
[]
[]
[null,null,"GENERAL INFORMATION",null,null,null,"UPLOADS"]
[]
[null,null,null,null,null,null,null,"File(s)"]
[]
[]
[]
[]
{"$rows_left_out":64}
{"sheet":"10) Process Capability Studies","index":20,"n_rows":43,"n_cols":19,"rows_kept":43,"cut":false,"hidden":false,"merged":[[27,7,27,9],[5,5,5,6],[5,12,5,14],[6,5,6,6],[6,12,6,14],[7,5,7,6],[7,12,7,14],[23,6,23,9],[24,6,24,9],[8,5,8,6],[8,12,8,13],[9,5,9,6],[9,12,9,13],[15,6,15,9],[19,6,19,9],[17,6,17,9]]}
[]
[]
[]
[null,null,null,"GENERAL INFORMATION",null,null,null,null,null,null,null,null,null,null,null,"UPLOADS"]
[]
[null,null,null,null,null,null,null,null,null,null,null,null,null,null,null,"File(s)"]
[]
[]
[]
[]
{"$rows_left_out":34}
{"sheet":"11) Performance Test Report","index":21,"n_rows":48,"n_cols":18,"rows_kept":48,"cut":false,"hidden":false,"merged":[[29,9,29,11],[11,17,11,19],[19,5,19,6],[21,5,21,6],[25,5,25,6],[15,5,15,6],[26,5,26,6],[17,5,17,6],[8,4,8,5],[8,8,8,12],[9,4,9,5],[9,8,9,12],[5,4,5,5],[5,8,5,12],[6,4,6,5],[6,8,6,12],[7,4,7,5],[7,8,7,12]]}
[]
[]
[]
[null,null,null,"GENERAL INFORMATION",null,null,null,null,null,null,null,null,null,"UPLOADS"]
[]
[null,null,null,null,null,null,null,null,null,null,null,null,null,"File(s)"]
[]
[]
[]
[]
{"$rows_left_out":39}
{"sheet":"12) Material Test Report","index":22,"n_rows":45,"n_cols":16,"rows_kept":45,"cut":false,"hidden":false,"merged":[[34,8,34,9],[34,4,34,5],[32,4,32,5],[32,8,32,9],[35,4,35,5],[35,8,35,9],[33,4,33,5],[33,8,33,9],[41,4,41,5],[41,8,41,9],[36,4,36,5],[36,8,36,9],[40,4,40,5],[40,8,40,9],[38,4,38,5],[38,8,38,9],[37,4,37,5],[37,8,37,9],[39,4,39,5],[39,8,39,9],[28,11,28,13],[28,4,28,5],[29,4,29,5],[5,8,5,9],[6,8,6,9],[7,8,7,9],[8,8,8,9],[9,8,9,9],[15,6,15,8],[19,6,19,8],[21,6,21,8],[25,4,25,5],[26,4,26,5],[25,6,25,7],[26,6,26,7],[17,6,17,8],[31,4,31,5],[31,8,31,9],[29,8,29,9],[30,4,30,5],[30,8,30,9]]}
[]
[]
[]
[null,null,null,"GENERAL INFORMATION",null,null,null,null,null,null,"UPLOADS"]
[]
[null,null,null,null,null,null,null,null,null,null,"File(s)"]
[]
[]
[]
[]
{"$rows_left_out":36}
{"sheet":"13) Dimensional Test Report","index":23,"n_rows":51,"n_cols":12,"rows_kept":51,"cut":false,"hidden":false,"merged":[[25,3,25,4],[25,5,25,6],[26,3,26,4],[26,5,26,6],[15,5,15,7],[19,5,19,7],[21,5,21,7],[17,5,17,7]]}
[]
[]
[]
[null,null,"GENERAL INFORMATION",null,null,null,null,null,null,"UPLOADS"]
[]
[null,null,null,null,null,null,null,null,null,"File(s)"]
[]
[]
[]
[]
{"$rows_left_out":42}
{"sheet":"14) Appearance Approval Report","index":24,"n_rows":45,"n_cols":17,"rows_kept":45,"cut":false,"hidden":false,"merged":[[15,3,15,4],[29,12,29,14]]}
[]
[]
[]
[null,null,null,"GENERAL INFORMATION",null,null,null,null,null,"UPLOADS"]
[]
[null,null,null,null,null,null,null,null,null,"File(s)"]
[]
[]
[]
[]
{"$rows_left_out":36}
{"sheet":"Calc_MSA","index":25,"n_rows":456,"n_cols":15,"rows_kept":456,"cut":false,"hidden":true,"merged":[]}
[]
[]
[null,"MSA SIMPLE"]
[null,null,null,null,null,"STDV",{"$f":"rng_msa_sim_dv1","v":{"$error":"#NAME?"}}]
[null,null,null,"No","data","avarage","UCL","LCL",null,"No.","range","range -","UCL","LCL"]
[null,null,null,1,{"$f":"IF(#REF!<>\"\",#REF!,\"\")","v":{"$error":"#REF!"}},{"$f":"IF(E6<>\"\",AVERAGE(E6:E65),\"\")","v":{"$error":"#REF!"}},{"$f":"+F6+(3*$G$4)","v":{"$error":"#REF!"}},{"$f":"+F6-(3*$G$4)","v":{"$error":"#REF!"}},null,{"$f":"D6","v":1},null,{"$f":"AVERAGE(K7:K65)","v":0},{"$f":"+L6+(3*_xlfn.STDEV.P(K7:K65))","v":0},{"$f":"IF(L6-(3*_xlfn.STDEV.P(K7:K65))<0,0,(L6-(3*_xlfn.STDEV.P(K7:K65))))","v":0}]
[null,null,null,{"$f":"D6+1","v":2},{"$f":"IF(#REF!<>\"\",#REF!,\"\")","v":{"$error":"#REF!"}},{"$f":"F6","v":{"$error":"#REF!"}},{"$f":"+F7+(3*$G$4)","v":{"$error":"#REF!"}},{"$f":"+F7-(3*$G$4)","v":{"$error":"#REF!"}},null,2,{"$f":"IFERROR(ABS(E6-E7),0)","v":0},{"$f":"L6","v":0},0,0]
[null,null,null,{"$f":"D7+1","v":3},{"$f":"IF(#REF!<>\"\",#REF!,\"\")","v":{"$error":"#REF!"}},{"$error":"#REF!"},{"$error":"#REF!"},{"$error":"#REF!"},null,3,0,0,0,0]
[null,null,null,4,{"$f":"IF(#REF!<>\"\",#REF!,\"\")","v":{"$error":"#REF!"}},{"$error":"#REF!"},{"$error":"#REF!"},{"$error":"#REF!"},null,4,0,0,0,0]
[null,null,null,5,{"$f":"IF(#REF!<>\"\",#REF!,\"\")","v":{"$error":"#REF!"}},{"$error":"#REF!"},{"$error":"#REF!"},{"$error":"#REF!"},null,5,0,0,0,0]
{"$rows_left_out":447}
{"sheet":"15) Measurement System Analysis","index":26,"n_rows":28,"n_cols":18,"rows_kept":28,"cut":false,"hidden":false,"merged":[[14,9,14,11],[5,4,5,5],[6,4,6,5],[7,4,7,5],[8,4,8,5],[9,4,9,5]]}
[]
[]
[]
[null,null,null,"GENERAL INFORMATION",null,null,null,null,"UPLOADS"]
[]
[null,null,null,null,null,null,null,null,"File(s)"]
[]
[]
[]
[]
{"$rows_left_out":19}
{"sheet":"16) Packaging Test Report","index":27,"n_rows":39,"n_cols":15,"rows_kept":39,"cut":false,"hidden":false,"merged":[[16,6,16,9],[20,6,20,9],[22,6,22,9],[24,6,24,9],[5,5,5,6],[6,5,6,6],[7,5,7,6],[8,5,8,6],[9,5,9,6],[18,6,18,9]]}
[]
[]
[]
[null,null,null,"GENERAL INFORMATION",null,null,null,null,null,null,null,null,null,"UPLOADS"]
[]
[null,null,null,null,null,null,null,null,null,null,null,null,null,"File(s)"]
[]
[]
[]
[]
{"$rows_left_out":30}
{"sheet":"17) Product- and Master Sample","index":28,"n_rows":34,"n_cols":18,"rows_kept":34,"cut":false,"hidden":false,"merged":[[18,4,18,7],[20,4,20,7],[16,4,16,7]]}
[]
[]
[]
[null,"GENERAL INFORMATION",null,null,null,null,null,null,null,null,null,null,null,null,null,"UPLOADS"]
[]
[null,null,null,null,null,null,null,null,null,null,null,null,null,null,null,"File(s)"]
[]
[]
[]
[]
{"$rows_left_out":25}
{"sheet":"18) Part Submission Warrant","index":29,"n_rows":85,"n_cols":26,"rows_kept":85,"cut":false,"hidden":false,"merged":[[77,13,77,16],[74,8,74,14],[78,3,78,8],[18,7,18,8],[71,3,71,8],[71,10,71,11],[71,12,71,18],[53,11,53,15],[62,7,62,18],[63,7,63,18],[65,11,65,18],[67,7,67,16],[69,4,69,8],[69,12,69,15],[69,16,69,17],[42,3,42,18],[85,13,85,18],[78,13,78,18],[79,13,79,18],[80,6,80,9],[80,13,80,18],[81,13,81,18],[82,6,82,9],[82,13,82,18],[83,13,83,18],[84,6,84,9],[84,13,84,18],[48,11,48,15],[49,11,49,15],[50,11,50,15],[51,11,51,15],[74,21,74,24],[54,11,54,15],[52,11,52,15],[35,13,35,17],[39,3,39,5],[40,3,40,18],[47,11,47,15],[43,3,43,18],[44,3,44,18],[45,11,45,15],[46,11,46,15],[35,3,35,7],[35,8,35,12],[5,4,5,8],[5,13,5,16],[7,1,7,4],[7,5,7,8],[7,13,7,16],[22,3,23,12],[22,17,25,18],[9,6,9,8],[9,13,9,16],[12,1,12,8],[12,10,12,17],[15,1,15,8],[15,10,15,17],[18,10,18,17],[18,1,18,3],[18,4,18,6]]}
[]
[]
[]
[]
[]
[null,"Part Name",null,null,{"$f":"VLOOKUP(\"D5\",rng_details,rng_details_input_col,FALSE)","v":0},null,null,null,null,"Customer Part No.",null,null,null," ",null,null,null,"Encl.",{"$f":"VLOOKUP(\"D13\",rng_details,rng_details_input_col,FALSE)","v":0},null,"UPLOADS"]
[null,null,null,null,null,null,null,null,null,null,null,null,null,null,null,null,null,null,null,null,"File(s)"]
[null,"Drawing No.",null,null,null,{"$f":"VLOOKUP(\"D11\",rng_details,rng_details_input_col,FALSE)","v":0},null,null,null,"Supplier Part No.",null,null,null," ",null,null,null,"Date",{"$f":"VLOOKUP(\"D16\",rng_details,rng_details_input_col,FALSE)","v":"00:00:00"}]
[]
[null,"Customer Drawing No.",null,null,null,null,null,null,null,"PPAP Po No.",null,null,null,{"$f":"VLOOKUP(\"D8\",rng_details,rng_details_input_col,FALSE)","v":0},null,null,null,"Weight"]
{"$rows_left_out":76}
{"sheet":"19) PSW Deviation Sheet","index":30,"n_rows":38,"n_cols":15,"rows_kept":38,"cut":false,"hidden":false,"merged":[[34,4,34,5],[36,4,36,5],[8,5,8,6],[9,5,9,6],[28,4,28,5],[29,4,29,5],[32,4,32,5],[33,4,33,5],[20,3,20,4],[19,3,19,4],[23,3,23,4],[24,3,24,4],[35,4,35,5],[31,4,31,5],[30,4,30,5],[5,5,5,6],[6,5,6,6],[7,5,7,6]]}
[]
[]
[]
[null,null,null,"GENERAL INFORMATION",null,null,null,null,null,null,null,null,null,"UPLOADS"]
[]
[null,null,null,null,null,null,null,null,null,null,null,null,null,"File(s)"]
[]
[]
[]
[]
{"$rows_left_out":29}
{"sheet":"20) Safety Data Sheet (SDS)","index":31,"n_rows":30,"n_cols":12,"rows_kept":30,"cut":false,"hidden":false,"merged":[[29,1,34,3]]}
[]
[]
[]
[null,"GENERAL INFORMATION",null,null,null,null,null,null,null,"UPLOADS"]
[]
[null,null,null,null,null,null,null,null,null,"File(s)"]
[]
[]
[]
[]
{"$rows_left_out":21}
{"sheet":"21) Form, Fit and Function","index":32,"n_rows":57,"n_cols":12,"rows_kept":57,"cut":false,"hidden":false,"merged":[[45,3,45,9],[5,5,5,6],[6,5,6,6],[7,5,7,6],[8,5,8,6],[9,5,9,6],[29,3,29,9],[15,3,15,4],[21,3,21,4],[22,3,22,4],[25,3,25,4],[26,3,26,4]]}
[]
[]
[]
[null,null,null,"GENERAL INFORMATION",null,null,null,null,null,"UPLOADS"]
[]
[null,null,null,null,null,null,null,null,null,"File(s)"]
[]
[]
[]
[]
{"$rows_left_out":48}
{"sheet":"22) Qualified Lab. Doc.","index":33,"n_rows":22,"n_cols":10,"rows_kept":22,"cut":false,"hidden":false,"merged":[[38,5,38,6],[38,8,38,9],[39,5,39,6],[39,8,39,9],[41,5,41,6],[41,8,41,9],[40,5,40,6],[40,8,40,9],[36,5,36,6],[36,8,36,9],[37,5,37,6],[37,8,37,9],[33,5,33,6],[33,8,33,9],[34,5,34,6],[34,8,34,9],[35,5,35,6],[35,8,35,9],[29,5,29,6],[29,8,29,9],[31,5,31,6],[31,8,31,9],[32,5,32,6],[32,8,32,9],[30,5,30,6],[30,8,30,9],[26,5,26,6],[26,8,26,9],[27,5,27,6],[27,8,27,9],[28,5,28,6],[28,8,28,9],[24,5,24,6],[24,8,24,9],[25,5,25,6],[25,8,25,9],[21,5,21,6],[21,8,21,9],[22,5,22,6],[22,8,22,9],[23,5,23,6],[23,8,23,9],[20,1,20,9],[15,1,15,9],[16,1,16,9],[17,1,17,9],[18,6,18,7],[19,1,19,9]]}
[]
[]
[]
[null,"GENERAL INFORMATION",null,null,null,null,null,null,"UPLOADS"]
[]
[null,null,null,null,null,null,null,null,"File(s)"]
[]
[]
[]
[]
{"$rows_left_out":13}
{"sheet":"23) List of checking aids","index":34,"n_rows":15,"n_cols":8,"rows_kept":15,"cut":false,"hidden":false,"merged":[]}
[]
[]
[]
[null,"GENERAL INFORMATION",null,null,null,null,"UPLOADS"]
[]
[]
[]
[]
[]
[]
{"$rows_left_out":6}
{"sheet":"24) Sub Supplier Source Details","index":35,"n_rows":15,"n_cols":8,"rows_kept":15,"cut":false,"hidden":false,"merged":[]}
[]
[]
[]
[null,"GENERAL INFORMATION",null,null,null,null,"UPLOADS"]
[]
[]
[]
[]
[]
[]
{"$rows_left_out":6}
{"sheet":"25) Type Name (in TOC)","index":36,"n_rows":13,"n_cols":24,"rows_kept":13,"cut":false,"hidden":false,"merged":[]}
[]
[]
[]
[null,null,"GENERAL INFORMATION"]
[]
[]
[]
[]
[]
[]
{"$rows_left_out":4}
{"sheet":"26) Type Name (in TOC)","index":37,"n_rows":13,"n_cols":3,"rows_kept":13,"cut":false,"hidden":false,"merged":[]}
[]
[]
[]
[null,1,"GENERAL INFORMATION"]
[]
[]
[]
[]
[]
[null,"No attached"]
{"$rows_left_out":4}
{"sheet":"27) Type Name (in TOC)","index":38,"n_rows":13,"n_cols":3,"rows_kept":13,"cut":false,"hidden":false,"merged":[]}
[]
[]
[]
[null,1,"GENERAL INFORMATION"]
[]
[]
[]
[]
[]
[null,"No attached"]
{"$rows_left_out":4}
{"sheet":"28) Type Name (in TOC)","index":39,"n_rows":13,"n_cols":3,"rows_kept":13,"cut":false,"hidden":false,"merged":[]}
[]
[]
[]
[null,1,"GENERAL INFORMATION"]
[]
[]
[]
[]
[]
[null,"No attached"]
{"$rows_left_out":4}
{"sheet":"29) Type Name (in TOC)","index":40,"n_rows":13,"n_cols":3,"rows_kept":13,"cut":false,"hidden":false,"merged":[]}
[]
[]
[]
[null,1,"GENERAL INFORMATION"]
[]
[]
[]
[]
[]
[null,"No attached"]
{"$rows_left_out":3}